No.,�i�P�j2022�N�̂��o�Y���ɂ��ċ����Ă�������,�i�Q�j���o�Y���ꂽ���́A���o�Y���̂��N��������Ă�������,�i�R�j���o�Y���ꂽ���̌��݂̏A�J�󋵂������Ă��������i�ЂƂI���j,�i�S�j���o�Y���ꂽ���ƌ��݈ꏏ�ɂ��Z�܂��ŁA���A���v�����ɂ��Ă�����i���ш��j�������Ă��������i���Ă͂܂���̂����ׂđI���j,�i�T�j�@���o�Y���ꂽ���̃p�[�g�i�[�i�z��҂��܂ށj�̌��݂̏A�J�󋵂������Ă��������i�ЂƂI���j,�i�U�j2022�N�ɂ��o�Y���ꂽ���q����ȊO�ŁA�������Ă��邨�q����̐l���������Ă�������,�i�U�j�|�P�D�y�P�l�ځz2022�N�ɂ��o�Y���ꂽ���q����ȊO�ŁA�������Ă��邨�q����̏A�w�󋵂��1�q����N��ɋ����Ă�������,�i�U�j�|�P�D�y�Q�l�ځz2022�N�ɂ��o�Y���ꂽ���q����ȊO�ŁA�������Ă��邨�q����̏A�w�󋵂��1�q����N��ɋ����Ă�������,�i�U�j�|�P�D�y�R�l�ځz2022�N�ɂ��o�Y���ꂽ���q����ȊO�ŁA�������Ă��邨�q����̏A�w�󋵂��1�q����N��ɋ����Ă�������,�i�U�j�|�P�D�y�S�l�ځz2022�N�ɂ��o�Y���ꂽ���q����ȊO�ŁA�������Ă��邨�q����̏A�w�󋵂��1�q����N��ɋ����Ă�������,�i�V�j���݂̐��ёS�̂̔N�Ԏ����i�ŁE�Еۓ��T���O�j�������Ă��������i�ЂƂI���j,�i�W�j�@���Ȃ������Z���̋�������Ă��������i�ЂƂI���j,�i�X�j���l�s���ł̋��Z�N���������Ă��������i�ЂƂI���j,�i�P�O�j�o�Y�̂��o���ɂ��ċ����Ă��������i�ЂƂI���j,�i�P�P�j�o�Y���@�ɂ��ċ����Ă��������i�ЂƂI���j,�i�P�Q�j�o�Y���ꂽ��Ë@�ցi�a�@�E�f�Ï��E���Y���j��I�ԍہA�d���������Ƃ������Ă��������i�ő�R�j,�i�P�R�j���A��o�Y�̗L���ɂ��ċ����Ă��������i�ЂƂI���j,�i�P�S�j�i�P�R�j�Łu�P�D�s���ŗ��A��o�Y�����v�u�Q�D�s�O�ŗ��A��o�Y�����v���ɂ��f�����܂��B�����A���A��悩�玩��ɖ߂�ꂽ�������Ă��������i�ЂƂI���j,�i�P�T�j2022�N�̔D�P�E�o�Y�ɂ������p�i�D�P�O���猻�݂܂Łj�ɂ��Čo�ϓI���S���̒��x�������Ă��������i�ЂƂI���j,�i�P�U�j�|�P�D�D�P�O�i�s�D���Â̊��Ԃ��܂ށj�`�D�P���̌o�ϓI���S���̒��x�i�ЂƂI���j,�i�P�U�j�|�Q�D���؎��`�o�Y��3�����i�މ@��̏�����p�����܂ށj�̌o�ϓI���S���̒��x�i�ЂƂI���j,�i�P�U�j�|�R�D�o�Y��4�����ڈȍ~�i������A�玙��j�̌o�ϓI���S���̒��x�i�ЂƂI���j,�i�P�V�j�|�P�D�D�P�O�i�s�D���Â̊��Ԃ��܂ށj�`�D�P���ɕ��S���傫���Ɗ�������p�i�ő�R�I���j,�i�P�V�j�|�Q�D���؎��`�o�Y��R�����i�މ@��̏�����p�����܂ށj�ɕ��S���傫���Ɗ�������p�i�ő�R�I���j,�i�P�V�j�|�R�D�o�Y��4�����ڈȍ~�ɕ��S���傫���Ɗ�������p�i�ő�R�I���j,�i�P�W�j���o�Y���ꂽ���ɂ��f�����܂��B2022�N�̔D�P�E�o�Y�ɂ����āA�D�P�O���猻�݂܂ł̐��_�I�ȕ��S���̒��x�������Ă��������i�ЂƂI���j,�i�P�W�j�|�P�D2022�N�̔D�P�E�o�Y�ɂ����āA���_�I�ȕ��S���傫�����������������Ă��������i�ő�R�I���j,�i�P�W�j�|�Q�D2022�N�̔D�P�E�o�Y�ɂ����āA���_�I�ȕ��S�̗v���������Ă��������i���Ă͂܂���̂����ׂđI���j,�i�P�X�j���o�Y���ꂽ���ɂ��f�����܂��B2022�N�̔D�P�E�o�Y�ɂ����āA�D�P�O���猻�݂܂łɊ������ǓƊ���Ǘ����̒��x�������Ă��������i�ЂƂI���j,�i�P�X�j�|�P�D2022�N�̔D�P�E�o�Y�ɂ����āA�D�P�O���猻�݂܂łɊ������ǓƊ���Ǘ����������������������Ă��������i�ő�R�I���j,�i�P�X�j�|�Q�D2022�N�̔D�P�E�o�Y�ɂ����āA�Ǘ�����ǓƊ��������������v���������Ă��������i���Ă͂܂���̂����ׂđI���j,�i�Q�O�j���o�Y���ꂽ���ɂ��f�����܂��B2022�N�̔D�P�E�o�Y�̍ۂɋx�ɁE�x�Ɛ��x���𗘗p���܂������i���Ă͂܂���̂����ׂđI���j,�i�Q�O�j�|�P�D�o�Y��Ɏ擾�����x�ɁE�x�Ƃ̍��v���ԁi�Y��x�Ɗ��ԂW�T�Ԃ������j�������Ă��������B���݁A�玙�x�ƒ��̕��͗\����Ԃ����񓚂��������i�ЂƂI���j,�i�Q�O�j�|�Q�D�o�Y��Ɏ擾�����x�ɁE�x�Ƃ̍��v���Ԃ͗\�肵�Ă������Ԃł����i�ЂƂI���j,�i�Q�O�j�|�R�D�o�Y��Ɏ擾�����x�ɁE�x�Ƃ̍��v���Ԃ��\������Z���Ȃ������R�������Ă��������i���Ă͂܂���̂����ׂđI���j,�i�Q�O�j�|�R�D�o�Y��Ɏ擾�����x�ɁE�x�Ƃ̍��v���Ԃ��\����������Ȃ������R�������Ă��������i���Ă͂܂���̂����ׂđI���j,�i�Q�P�j�p�[�g�i�[�i�z��҂��܂ށj�̕��ɂ��f�����܂��B2022�N�̔D�P�E�o�Y�ɂ����āA�D�P�O���猻�݂܂ł̐��_�I�ȕ��S���̒��x�������Ă��������i�ЂƂI���j,�i�Q�P�j�|�P�D2022�N�̔D�P�E�o�Y�ɂ����āA���_�I�ȕ��S���ł��傫�����������������Ă��������i�ő�R�I���j,�i�Q�P�j�|�Q�D2022�N�̔D�P�E�o�Y�ɂ����āA���_�I�ȕ��S���傫�������v���������Ă��������i���Ă͂܂���̂����ׂđI���j,�i�Q�Q�j�p�[�g�i�[�i�z��҂��܂ށj�̕��ɂ��f�����܂��B2022�N�̔D�P�E�o�Y�ɂ����āA�D�P�O���猻�݂܂łɊ������ǓƊ���Ǘ����̒��x�������Ă��������i�ЂƂI���j,�i�Q�Q�j�|�P�D2022�N�̔D�P�E�o�Y�ɂ����āA�D�P�O���猻�݂܂łɊ������ǓƊ���Ǘ����������������������Ă��������i�ő�R�I���j,�i�Q�Q�j�|�Q�D2022�N�̔D�P�E�o�Y�ɂ����āA�Ǘ�����ǓƊ����ł������������v���������Ă��������i���Ă͂܂���̂����ׂđI���j,�i�Q�R�j�p�[�g�i�[�i�z��҂��܂ށj�̕��ɂ��f�����܂��B2022�N�̔D�P�E�o�Y�̍ۂɋx�ɁE�x�Ɛ��x���𗘗p���܂������i���Ă͂܂���̂����ׂđI���j,�i�Q�R�j�|�P�D�o�Y��Ɏ擾�����x�ɁE�x�Ƃ̍��v���Ԃ������Ă��������B���݁A�玙�x�ƒ��̕��͗\����Ԃ����񓚂��������i�ЂƂI���j,�i�Q�R�j�|�Q�D�o�Y��Ɏ擾�����x�ɁE�x�Ƃ̍��v���Ԃ͗\�肵�Ă������Ԃł����i�ЂƂI���j,�i�Q�R�j�|�R�D�o�Y��Ɏ擾�����x�ɁE�x�Ƃ̍��v���Ԃ��\������Z���Ȃ������R�������Ă��������i���Ă͂܂���̂����ׂđI���j,�i�Q�R�j�|�R�D�o�Y��Ɏ擾�����x�ɁE�x�Ƃ̍��v���Ԃ��\����������Ȃ������R�������Ă��������i���Ă͂܂���̂����ׂđI���j,�i�Q�S�j�o�Y��ɓ��퐶����玙�Ɋւ��āA���Ȃ��̎q��Ă��T�|�[�g�������ɂ��ċ����Ă��������i���Ă͂܂���̂����ׂđI���j,�i�Q�S�j�|�P�D�o�Y��ɓ��퐶����玙�Ɋւ��Ă��Ȃ����󂯂��T�|�[�g�ɂ��ċ����Ă��������i���Ă͂܂���̂����ׂđI���j,�i�Q�T�j�o�Y��ɓ��퐶����玙�Ɋւ��Ă��Ȃ������p�����T�[�r�X�i�L���j�ɂ��ċ����Ă��������i���Ă͂܂���̂����ׂđI���j,�i�Q�U�j�o�Y��ɓ��퐶����玙�Ɋւ��āA�o�ϓI�ȕ��S���l���Ȃ��ꍇ�A�ǂ̂悤�ȃT�[�r�X�𗘗p�������ƍl���܂����i���Ă͂܂���̂����ׂđI���j,�i�Q�V�j���Ȃ������Z��ł���n��́A�q��Đ��тɂƂ��āA�q��Ă��₷�������Ǝv���܂����i�ЂƂI���j,�i�Q�W�j���Ȃ������X�̎q��Đ����̒��ŁA�q�ǂ���A��ĊO�o����ۓ��Ɋ��������育�Ƃ�s�ւ����������Ƃ������Ă��������i���Ă͂܂���̂����ׂđI���j,�i�Q�X�j�D�P�E�o�Y�E�q��Ăɖ𗧂����ǂ̂悤�Ɏ��W���Ă��܂����i���Ă͂܂���̂����ׂđI���j,�i�R�O�j���̂��q������o�Y�������Ǝv���܂����i�ЂƂI���j,�i�R�O�j�|�P�D���̂��q����̏o�Y�ŐS�z���Ă��邱�Ƃ�����΋����Ă��������i���Ă͂܂���̂����ׂđI���j,�i�R�P�j����A�D�P�E�o�Y�ɂ����ĉ��l�s�Ɋ��҂���s���T�[�r�X��x��������΋����Ă��������i���R�L�q�j,�i�R�Q�j�{�����ɂ��񓚂��ꂽ��ȕ��ɂ��ċ����Ă��������i�ЂƂI���j
1,11��,�R�D25�΁`29��,�S�D�p�[�g�E�A���o�C�g���ŏA�J,"�P�D�p�[�g�i�[�i�z��҂��܂ށj,�Q�D�q�ǂ��i����o�Y���ꂽ���q����ȊO�j",�P�D�t���^�C���i���Ј��j�ŏA�J�i���Z�Ζ������܂ށj,1,�Q�D�ۈ牀���^�c�t�����^�F�肱�ǂ�����,,,,�T�D�U�O�O���~�`�U�X�X���~,�W�D�`�k,�R�D�T�`10�N����,�Q�D�o�Y�w�i�ߋ��ɏo�Y�o��������j,�Q�D���R���؂�����ÓI�ȍs�ׁi�z�����؁A��q���؁j�𔺂���,"�S�D�{�݂̕��j�i�����̖]�ޏo�Y���@�����d���Ă��炦��A���j�ɋ����ł���j,�U�D���������o�Y�E�t���Y�����@���\,�X�D�a�������ǂ��i��DLDR������A�����I���ł���A�������Y�퓙�j",�R�D���A��o�Y���Ă��Ȃ�,,�P�D���ɕ��S��������,�P�D���ɕ��S��������,�P�D���ɕ��S��������,�T�D���܂蕉�S�������Ȃ�����,"�R�D�D�w���N�f���i�D�w���f�j�E���Y�t�O����,�S�D�َ��X�N���[�j���O������i�o���O�f�f���j�i��DNIPT�A�r�������A��̌����}�[�J�[���j",�P�D���؎��̓��@�E���ؔ�,"�R�D�ʉ@��ړ����̌�ʔ�i�^�N�V�[�j,�S�D���ނ�~���N�A�ߗޓ��̏��Ղ���玙�p�i��",�Q�D��╉�S��������,�U�D�o�Y��Q�����`�R������,"�P�D�̒��s�ǂ��J,�Q�D������玙�ɂ�鐇���s��,�W�D�Ǝ��ƈ玙�̗���",�T�D�S�������Ȃ�����,,,�S�D��L�P�`�R�̂�����̐��x�����p���Ă��Ȃ��i�܂��͗��p�\�ȑΏۂł͂Ȃ������j,,,,,�Q�D��╉�S��������,"�U�D�o�Y��Q�����`�R������,�V�D�o�Y��S�����`�W������","�Q�D�玙�ɂ���J�E�����s��,�V�D�d���ƉƎ��E�玙�̗���",�T�D�S�������Ȃ�����,,,�P�D�玙�x�Ɛ��x�𗘗p�����E���Ă���,�U�D�U�����ȏ�,�P�D�\�肵�Ă������Ԃł���,,,"�P�D�p�[�g�i�[�i�z��҂��܂ށj,�Q�D���o�Y���ꂽ���̐e,�R�D�p�[�g�i�[�i�z��҂��܂ށj�̐e","�P�D�Ǝ��i�������E�H���E�|���E���󓙁j,�Q�D�Ԃ����̈玙,�R�D���傤�������̈玙,�U�D�玙�Ɋւ��鑊�k","�Q�D�ו��z���i�H���i���A���������̎���z���T�[�r�X�j,�P�Q�D���̑�","�P�D�Ǝ���s�i�������E�H���E�|���E���󓙁j,�R�D��H�T�[�r�X�i�①�E�Ⓚ�ٓ��A����u�����������j,�S�D�ו��z���i�H���i���A���������̎���z���T�[�r�X�j,�T�D�x�r�[�V�b�^�[,�U�D�ۈ珊�E�w�Z�E�K�����Ƃ̑��},�V�D�ꎞ�a����i�ꎞ�ۈ�A���c���ꎞ�a����A�x���ꎞ�ۈ瓙�j,�P�Q�D�ړ��x���i�D�w�x���^�N�V�[�A�}�}�T�|�[�g�^�N�V�[���j",�S�D���܂肻���v��Ȃ�,"�P�D�q�A��O�o�ւ̎��̗͂������R����,�Q�D������ʋ@�ւ𗘗p����ۂ̎��̗͂������R����,�U�D���H�E�����������E��Ȃ��Ɗ�����,�V�D������ʋ@�ւ��g���Â炢,�X�D�x�r�[�J�[�ł̊O�o�E�ړ��ɂ����āA�s�ւ�������,�P�R�D���̑�","�X�DYouTube�i���[�`���[�u�j,�P�P�D�m�l�A�F�l,�P�Q�D��t�E���Y�t�E�Ō�t���̈�Ï]����,�P�T�D�ۈ珊�E�c�t���E�F�肱�ǂ�����",�P�D�����v��,"�P�D���݂̎q��ĂŐ���t,�Q�D�����I�Ȉ玙�ւ̕s��,�T�D�����I�Ȑ�����E�q�ǂ��̋����,�U�D�����I�ȏZ����E�Z���X�y�[�X���L���ꏊ�ւ̏Z�ւ�,�V�D�E��̗����𓾂�̂����,�W�D�d���ւ̉e���i�L�����A�⏸���j,�X�D�p�[�g�i�[�i�z��҂��܂ށj�Ƃ̉Ǝ��E�玙�̖������S,�P�O�D������v�w�̎��Ԋm��",�o�Y��p���⏕���������Ă������̂ŁA�����ƌo�ϓI�x�����~�����B �����̎q��0�΂̎��͕���玙�����邽�߂ɉƂŖʓ|���������̂ɁA��̎q���F�ۈ牀�ɍs�������邽�߂ɂ͉��̎q���a���Ďd�������Ȃ���΂Ȃ�Ȃ��B�u�Ƃɂ���Ȃ�A��̎q�̖ʓ|��������̂�����A�ۈ牀�͕K�v�Ȃ��v�Ƃ����s�̍l�����͊Ԉ���Ă���Ǝv���B1�l�ŁA�O�Ύ��̖ʓ|�����Ȃ���A�Ǝ������āA�C���C�����̏�̎q�̖ʓ|�������Ɍ���Ȃ�Ă�����ςȂ��Ƃ��ł��ē�����O���Ƃ����悤�ȃX�^���X���s�����Ƃ��Ă��邩��A���q�����~�܂�Ȃ��̂��Ǝv���B,�P�D���o�Y���ꂽ��
2,11��,�R�D25�΁`29��,�Q�D�t���^�C���i���Ј��j�ŏA�J�i�Y�x�E��x���j,�P�D�p�[�g�i�[�i�z��҂��܂ށj,�P�D�t���^�C���i���Ј��j�ŏA�J�i���Z�Ζ������܂ށj,0,,,,,�S�D�T�O�O���~�`�T�X�X���~,�W�D�`�k,�Q�D�P�`�T�N����,�P�D���Y�w�i���񂪏��Y�j,�Q�D���R���؂�����ÓI�ȍs�ׁi�z�����؁A��q���؁j�𔺂���,"�P�D�����Ƒ�����̋������߂�,�R�D�{�݂̒m���x�E���R�~�E�]��,�T�D���ɕ��؁E�a�ɕ��؂��\,�X�D�a�������ǂ��i��DLDR������A�����I���ł���A�������Y�퓙�j",�R�D���A��o�Y���Ă��Ȃ�,,�P�D���ɕ��S��������,�Q�D���Ȃ蕉�S��������,�P�D���ɕ��S��������,�P�D���ɕ��S��������,"�R�D�D�w���N�f���i�D�w���f�j�E���Y�t�O����,�S�D�َ��X�N���[�j���O������i�o���O�f�f���j�i��DNIPT�A�r�������A��̌����}�[�J�[���j,�T�D�\�h�ڎ�E�R�̌�����i�C�ӂ̂��̂Ɍ���j�i��D������̗\�h�ڎ�E�R�̌����A�C���t���G���U�\�h�ڎ퓙�j,�V�D�}�^�j�e�B�p�i��,�X�D���e������̃T�|�[�g�ɂ������p�i��ʔ�E������j�i��D���A��o�Y�̂��߂̋A�ȁA�ꎞ�I�ȌĂъ񂹂ɂ�铯���Ȃǁj","�P�D���؎��̓��@�E���ؔ�,�S�D����O���E������k��,�U�D���ނ�~���N�A�ߗޓ��̏��Ղ���玙�p�i��,�V�D�x�r�[�x�b�h��x�r�[�J�[���̕��i�̈玙�p�i��,�X�D���e������̃T�|�[�g�ɂ������p�i��ʔ�E������j�i��D���A��o�Y�̂��߂̋A�ȁA�ꎞ�I�ȌĂъ񂹂ɂ�铯���Ȃǁj","�P�D����O���E������k��,�S�D���ނ�~���N�A�ߗޓ��̏��Ղ���玙�p�i��,�T�D�x�r�[�x�b�h��x�r�[�J�[���̕��i�̈玙�p�i��,�V�D���e������̃T�|�[�g�ɂ������p�i��ʔ�E������j�i��D���A��o�Y�̂��߂̋A�ȁA�ꎞ�I�ȌĂъ񂹂ɂ�铯���Ȃǁj",�P�D���ɕ��S��������,"�Q�D�D�P�����i�D�P�P�����`�S�����j,�S�D�D�P����i�D�P�W�����`�P�O�����j,�T�D�o�Y����`�P������,�U�D�o�Y��Q�����`�R������","�P�D�̒��s�ǂ��J,�U�D����̈玙�Ɋւ��đ��k����ꏊ��l�����Ȃ��E�v��������Ȃ�,�V�D�玙�Ɋւ��Ĉ�t����E�֑��k����ꏊ���Ȃ��E�v��������Ȃ�,�P�P�D�e��e�����Ƃ̉Ǝ��E�玙�̉��l�ς̑���A�l�Ԋ֌W,�P�Q�D�����I�Ȑ�����ւ̕s��",�Q�D��⊴����,"�Q�D�D�P�����i�D�P�P�����`�S�����j,�R�D�D�P�����i�D�P�T�����`�V�����j,�T�D�o�Y����`�P������","�P�D�̒��s�ǁE��J�ŊO�o����@�����,�T�D����̈玙�Ɋւ��đ��k����ꏊ��l�����Ȃ��E�v��������Ȃ�,�U�D�玙�Ɋւ��Ĉ�t����E�֑��k����ꏊ���Ȃ��E�v��������Ȃ�","�P�D�Y�O�x�Ɛ��x�𗘗p����,�Q�D�玙�x�Ɛ��x�𗘗p�����E���Ă���",�R�D�P�Q�����ȏ�P�W��������,�R�D�\������������Ԃł���,,"�P�D�ۈ珊�ɓ����ł��Ȃ���������,�Q�D�����Ȃ���玙�����邱�Ƃ��������",�Q�D��╉�S��������,"�Q�D�D�P�����i�D�P�P�����`�S�����j,�R�D�D�P�����i�D�P�T�����`�V�����j,�S�D�D�P����i�D�P�W�����`�P�O�����j,�T�D�o�Y����`�P������,�U�D�o�Y��Q�����`�R������,�V�D�o�Y��S�����`�W������,�W�D�o�Y��X�����`�P�Q������","�P�D�������̕ω�,�S�D���o�Y���ꂽ���̑̒��s�ǁE�����^���s��,�T�D����̈玙�Ɋւ��đ��k����ꏊ��l�����Ȃ��E�v��������Ȃ�,�U�D�玙�Ɋւ��Ĉ�t����E�֑��k����ꏊ���Ȃ��E�v��������Ȃ�",�Q�D��⊴����,�T�D�o�Y����`�P������,�P0�D���̑�,�Q�D�Ζ���̋x�ɐ��x�𗘗p�����E���Ă���i���ʋx�ɁE�L���x�ɓ��j,�P�D�T������,�P�D�\�肵�Ă������Ԃł���,,,"�P�D�p�[�g�i�[�i�z��҂��܂ށj,�Q�D���o�Y���ꂽ���̐e","�P�D�Ǝ��i�������E�H���E�|���E���󓙁j,�Q�D�Ԃ����̈玙,�S�D���}�E�ړ�",�X�D�x�r�[�x�b�h��x�r�[�J�[���̈玙�p�i�����^��,"�W�D�Y��P�A�i�ʂ��^�f�C�P�A�A�h���E�V���[�g�X�e�C�A���Y�t�K�ⓙ�j,�X�D����̈玙���k�E�J�E���Z�����O�i�I�����C���܂ށj",�Q�D��₻���v��,"�Q�D������ʋ@�ւ𗘗p����ۂ̎��̗͂������R����,�R�D�q�ǂ��ƍs����ꏊ�i�V�y�n�E���X���j�����Ȃ�,�T�D�}篂̑Ή��ŗ�������ꏊ�⋒�_�����Ȃ��i�}�Ȃ��ނς��E�������j,�X�D�x�r�[�J�[�ł̊O�o�E�ړ��ɂ����āA�s�ւ�������,�P�O�D�q�ǂ��ƊO�o�ł���ꏊ�E�V�ׂ�ꏊ�₨�X�̏�񂪏��Ȃ�","�U�DInstagram�i�C���X�^�O�����j,�P�Q�D��t�E���Y�t�E�Ō�t���̈�Ï]����",�Q�D�����v��Ȃ�,"�T�D�����I�Ȑ�����E�q�ǂ��̋����,�U�D�����I�ȏZ����E�Z���X�y�[�X���L���ꏊ�ւ̏Z�ւ�",,�R�D���o�Y���ꂽ���A�p�[�g�i�[�i�z��҂��܂ށj�̗���
3,12��,�S�D30�΁`34��,�Q�D�t���^�C���i���Ј��j�ŏA�J�i�Y�x�E��x���j,�P�D�p�[�g�i�[�i�z��҂��܂ށj,�P�D�t���^�C���i���Ј��j�ŏA�J�i���Z�Ζ������܂ށj,0,,,,,�V�D�W�O�O���~�`�W�X�X���~,18�D��,�R�D�T�`10�N����,�P�D���Y�w�i���񂪏��Y�j,�R�D���ɕ��؁E�a�ɕ���,"�T�D���ɕ��؁E�a�ɕ��؂��\,�V�D��Ðݔ��E��Ò񋟑̐����[�����Ă���i��D��t�E���Y�t�������ANICU������A�ً}���̑Ή����\���j,�P�P�D�D�w���f�ȊO�Œʉ@���Ă����i�ߋ��ɒʉ@�����������j",�Q�D�s�O�ŗ��A��o�Y����,�Q�D����2�������Ɏ���ɖ߂���,�R�D�ǂ���Ƃ������Ȃ�,�U�D�قƂ�Ǖ��S�������Ȃ�����,�S�D�ǂ���Ƃ������Ȃ�,�S�D�ǂ���Ƃ������Ȃ�,�R�D�D�w���N�f���i�D�w���f�j�E���Y�t�O����,"�U�D���ނ�~���N�A�ߗޓ��̏��Ղ���玙�p�i��,�V�D�x�r�[�x�b�h��x�r�[�J�[���̕��i�̈玙�p�i��",�S�D���ނ�~���N�A�ߗޓ��̏��Ղ���玙�p�i��,�R�D�ǂ���Ƃ������Ȃ�,�V�D�o�Y��S�����`�W������,�P�R�D ���̑�,�T�D�S�������Ȃ�����,,,"�P�D�Y�O�x�Ɛ��x�𗘗p����,�Q�D�玙�x�Ɛ��x�𗘗p�����E���Ă���,�R�D�Ζ���̋x�ɐ��x�𗘗p�����E���Ă���i���ʋx�ɁE�L���x�ɓ��j",�R�D�P�Q�����ȏ�P�W��������,�P�D�\�肵�Ă������Ԃł���,,,�T�D�S�����S�������Ȃ�����,,,�T�D�S�������Ȃ�����,,,�R�D��L�P�`�Q�̂�����̐��x�����p���Ă��Ȃ��i�܂��͗��p�\�ȑΏۂł͂Ȃ������j,,,,,"�P�D�p�[�g�i�[�i�z��҂��܂ށj,�Q�D���o�Y���ꂽ���̐e,�R�D�p�[�g�i�[�i�z��҂��܂ށj�̐e,�S�D���o�Y���ꂽ���E�p�[�g�i�[�i�z��҂��܂ށj�̐e�ȊO�̐e��","�P�D�Ǝ��i�������E�H���E�|���E���󓙁j,�Q�D�Ԃ����̈玙,�U�D�玙�Ɋւ��鑊�k",�P�R�D���p���Ă��Ȃ�,"�T�D�x�r�[�V�b�^�[,�V�D�ꎞ�a����i�ꎞ�ۈ�A���c���ꎞ�a����A�x���ꎞ�ۈ瓙�j,�W�D�Y��P�A�i�ʂ��^�f�C�P�A�A�h���E�V���[�g�X�e�C�A���Y�t�K�ⓙ�j",�R�D�ǂ���Ƃ������Ȃ�,"�R�D�q�ǂ��ƍs����ꏊ�i�V�y�n�E���X���j�����Ȃ�,�T�D�}篂̑Ή��ŗ�������ꏊ�⋒�_�����Ȃ��i�}�Ȃ��ނς��E�������j,�U�D���H�E�����������E��Ȃ��Ɗ�����","�P�D���l�s�i������j�z�[���y�[�W,�P�Q�D��t�E���Y�t�E�Ō�t���̈�Ï]����",�P�D�����v��,"�T�D�����I�Ȑ�����E�q�ǂ��̋����,�U�D�����I�ȏZ����E�Z���X�y�[�X���L���ꏊ�ւ̏Z�ւ�,�W�D�d���ւ̉e���i�L�����A�⏸���j,�P�O�D������v�w�̎��Ԋm��",,�P�D���o�Y���ꂽ��
4,�Q��,�T�D35�΁`39��,�U�D�p�[�g�E�A���o�C�g���ŏA�J���Ă������A�D�P�E�o�Y���@�ɑސE,"�P�D�p�[�g�i�[�i�z��҂��܂ށj,�Q�D�q�ǂ��i����o�Y���ꂽ���q����ȊO�j",�W�D���̑�,1,�Q�D�ۈ牀���^�c�t�����^�F�肱�ǂ�����,,,,�P�D�R�O�O���~����,�T�D�_�ސ�,�T�D20�N�ȏ�,�Q�D�o�Y�w�i�ߋ��ɏo�Y�o��������j,�P�D���R����,"�P�D�����Ƒ�����̋������߂�,�Q�D��p������",�R�D���A��o�Y���Ă��Ȃ�,,�Q�D��╉�S��������,�R�D��╉�S��������,�R�D��╉�S��������,�S�D�ǂ���Ƃ������Ȃ�,"�Q�D�D�P�m��f�@��i���f�j,�R�D�D�w���N�f���i�D�w���f�j�E���Y�t�O����,�V�D�}�^�j�e�B�p�i��","�U�D���ނ�~���N�A�ߗޓ��̏��Ղ���玙�p�i��,�V�D�x�r�[�x�b�h��x�r�[�J�[���̕��i�̈玙�p�i��",�S�D���ނ�~���N�A�ߗޓ��̏��Ղ���玙�p�i��,�S�D���܂蕉�S�������Ȃ�����,"�Q�D�D�P�����i�D�P�P�����`�S�����j,�S�D�D�P����i�D�P�W�����`�P�O�����j,�T�D�o�Y����`�P������","�P�D�̒��s�ǂ��J,�Q�D������玙�ɂ�鐇���s��",�T�D�S�������Ȃ�����,,,�T�D�Y���Ȃ�,,,,,�T�D�S�����S�������Ȃ�����,,,�S�D���܂芴���Ȃ�����,�T�D�o�Y����`�P������,�P�D�Ǝ��E�玙�ŊO�o����@�����,�S�D�Y���Ȃ�,,,,,"�P�D�p�[�g�i�[�i�z��҂��܂ށj,�Q�D���o�Y���ꂽ���̐e","�P�D�Ǝ��i�������E�H���E�|���E���󓙁j,�Q�D�Ԃ����̈玙,�R�D���傤�������̈玙",�P�R�D���p���Ă��Ȃ�,�W�D�Y��P�A�i�ʂ��^�f�C�P�A�A�h���E�V���[�g�X�e�C�A���Y�t�K�ⓙ�j,�P�D�ƂĂ������v��,�X�D�x�r�[�J�[�ł̊O�o�E�ړ��ɂ����āA�s�ւ�������,"�U�DInstagram�i�C���X�^�O�����j,�P�S�D�n��q��Ďx�����_",�R�D���͍l�����Ȃ�,"�P�D���݂̎q��ĂŐ���t,�Q�D�����I�Ȉ玙�ւ̕s��,�R�D��̂̐g�̓I���S�E���N��ł̏o�Y,�T�D�����I�Ȑ�����E�q�ǂ��̋����,�U�D�����I�ȏZ����E�Z���X�y�[�X���L���ꏊ�ւ̏Z�ւ�,�P�O�D������v�w�̎��Ԋm��",,�P�D���o�Y���ꂽ��
5,�S��,�T�D35�΁`39��,�U�D�p�[�g�E�A���o�C�g���ŏA�J���Ă������A�D�P�E�o�Y���@�ɑސE,"�P�D�p�[�g�i�[�i�z��҂��܂ށj,�Q�D�q�ǂ��i����o�Y���ꂽ���q����ȊO�j,�V�D�p�[�g�i�[�i�z��҂��܂ށj�̕�e",�P�D�t���^�C���i���Ј��j�ŏA�J�i���Z�Ζ������܂ށj,2,�R�D���w��,�R�D���w��,,,�P�Q�D�Q�C�O�O�O���~�ȏ�,16�D�ۓy�P�J,�T�D20�N�ȏ�,�Q�D�o�Y�w�i�ߋ��ɏo�Y�o��������j,�S�D�鉤�؊J,�V�D��Ðݔ��E��Ò񋟑̐����[�����Ă���i��D��t�E���Y�t�������ANICU������A�ً}���̑Ή����\���j,�R�D���A��o�Y���Ă��Ȃ�,,�T�D�S�����S�������Ȃ�����,�V�D�S�����S�������Ȃ�����,�V�D�S�����S�������Ȃ�����,�V�D�S�����S�������Ȃ�����,"�Q�D�D�P�m��f�@��i���f�j,�R�D�D�w���N�f���i�D�w���f�j�E���Y�t�O����,�S�D�َ��X�N���[�j���O������i�o���O�f�f���j�i��DNIPT�A�r�������A��̌����}�[�J�[���j","�P�D���؎��̓��@�E���ؔ�,�U�D���ނ�~���N�A�ߗޓ��̏��Ղ���玙�p�i��","�Q�D�Y�w�A�p�[�g�i�[�i�z��҂��܂ށj�A�Ԃ����A���傤�������̗\�h�ڎ��i�C�ӂ̂��̂Ɍ���j�i��D�C���t���G���U�\�h�ڎ�A�����ӂ����j,�S�D���ނ�~���N�A�ߗޓ��̏��Ղ���玙�p�i��",�Q�D��╉�S��������,"�Q�D�D�P�����i�D�P�P�����`�S�����j,�T�D�o�Y����`�P������",�P�P�D�e��e�����Ƃ̉Ǝ��E�玙�̉��l�ς̑���A�l�Ԋ֌W,�Q�D��⊴����,�T�D�o�Y����`�P������,�S�D�D�w�E�e�q�ŏW�܂��ꏊ�E�C�x���g�����Ȃ�,�T�D�Y���Ȃ�,,,,,�T�D�S�����S�������Ȃ�����,,,�T�D�S�������Ȃ�����,,,�R�D��L�P�`�Q�̂�����̐��x�����p���Ă��Ȃ��i�܂��͗��p�\�ȑΏۂł͂Ȃ������j,,,,,"�P�D�p�[�g�i�[�i�z��҂��܂ށj,�R�D�p�[�g�i�[�i�z��҂��܂ށj�̐e,�V�D���̑�","�P�D�Ǝ��i�������E�H���E�|���E���󓙁j,�S�D���}�E�ړ�",�P�R�D���p���Ă��Ȃ�,"�U�D�ۈ珊�E�w�Z�E�K�����Ƃ̑��},�V�D�ꎞ�a����i�ꎞ�ۈ�A���c���ꎞ�a����A�x���ꎞ�ۈ瓙�j",�R�D�ǂ���Ƃ������Ȃ�,�X�D�x�r�[�J�[�ł̊O�o�E�ړ��ɂ����āA�s�ւ�������,"�U�DInstagram�i�C���X�^�O�����j,�P�P�D�m�l�A�F�l",�Q�D�����v��Ȃ�,"�P�D���݂̎q��ĂŐ���t,�R�D��̂̐g�̓I���S�E���N��ł̏o�Y",,�P�D���o�Y���ꂽ��
6,�Q��,�T�D35�΁`39��,�T�D�p�[�g�E�A���o�C�g���ŏA�J�i�Y�x�E��x���j,"�P�D�p�[�g�i�[�i�z��҂��܂ށj,�Q�D�q�ǂ��i����o�Y���ꂽ���q����ȊO�j",�P�D�t���^�C���i���Ј��j�ŏA�J�i���Z�Ζ������܂ށj,2,����,����,,,�R�D�S�O�O���~�`�S�X�X���~,14�D��,�S�D10�`20�N����,�Q�D�o�Y�w�i�ߋ��ɏo�Y�o��������j,�P�D���R����,"�P�D�����Ƒ�����̋������߂�,�V�D��Ðݔ��E��Ò񋟑̐����[�����Ă���i��D��t�E���Y�t�������ANICU������A�ً}���̑Ή����\���j,�P�P�D�D�w���f�ȊO�Œʉ@���Ă����i�ߋ��ɒʉ@�����������j",�R�D���A��o�Y���Ă��Ȃ�,,�S�D���܂蕉�S�������Ȃ�����,�T�D���܂蕉�S�������Ȃ�����,�T�D���܂蕉�S�������Ȃ�����,�Q�D���Ȃ蕉�S��������,"�Q�D�D�P�m��f�@��i���f�j,�R�D�D�w���N�f���i�D�w���f�j�E���Y�t�O����",�P�D���؎��̓��@�E���ؔ�,�W�D���̑�,�S�D���܂蕉�S�������Ȃ�����,"�Q�D�D�P�����i�D�P�P�����`�S�����j,�S�D�D�P����i�D�P�W�����`�P�O�����j,�T�D�o�Y����`�P������","�P�D�̒��s�ǂ��J,�P�Q�D�����I�Ȑ�����ւ̕s��",�T�D�S�������Ȃ�����,,,"�P�D�Y�O�x�Ɛ��x�𗘗p����,�Q�D�玙�x�Ɛ��x�𗘗p�����E���Ă���,�R�D�Ζ���̋x�ɐ��x�𗘗p�����E���Ă���i���ʋx�ɁE�L���x�ɓ��j",�S�D�P�W�����ȏ�Q�S��������,�R�D�\������������Ԃł���,,�P�D�ۈ珊�ɓ����ł��Ȃ���������,�T�D�S�����S�������Ȃ�����,,,�T�D�S�������Ȃ�����,,,�P�D�玙�x�Ɛ��x�𗘗p�����E���Ă���,�S�D�P�����`�R��������,�P�D�\�肵�Ă������Ԃł���,,,"�P�D�p�[�g�i�[�i�z��҂��܂ށj,�Q�D���o�Y���ꂽ���̐e,�R�D�p�[�g�i�[�i�z��҂��܂ށj�̐e,�T�D�m�l�E�F�l","�P�D�Ǝ��i�������E�H���E�|���E���󓙁j,�U�D�玙�Ɋւ��鑊�k",�P�O�D�ړ��x���i�D�w�x���^�N�V�[�A�}�}�T�|�[�g�^�N�V�[���j,"�P�D�Ǝ���s�i�������E�H���E�|���E���󓙁j,�S�D�ו��z���i�H���i���A���������̎���z���T�[�r�X�j,�T�D�x�r�[�V�b�^�[,�U�D�ۈ珊�E�w�Z�E�K�����Ƃ̑��}",�Q�D��₻���v��,"�T�D�}篂̑Ή��ŗ�������ꏊ�⋒�_�����Ȃ��i�}�Ȃ��ނς��E�������j,�U�D���H�E�����������E��Ȃ��Ɗ�����","�Q�D���l�s�̍L�񎆁A�`���V�A���q��,�U�DInstagram�i�C���X�^�O�����j,�P�P�D�m�l�A�F�l,�P�T�D�ۈ珊�E�c�t���E�F�肱�ǂ�����",�Q�D�����v��Ȃ�,"�R�D��̂̐g�̓I���S�E���N��ł̏o�Y,�T�D�����I�Ȑ�����E�q�ǂ��̋����,�U�D�����I�ȏZ����E�Z���X�y�[�X���L���ꏊ�ւ̏Z�ւ�",�Y��P�A�̖����� �����̒ʉ@�A���e���Ȃǂɖ����̑����T�[�r�X������Ƃ����Ǝv��,�P�D���o�Y���ꂽ��
7,�W��,�S�D30�΁`34��,�U�D�p�[�g�E�A���o�C�g���ŏA�J���Ă������A�D�P�E�o�Y���@�ɑސE,�P�D�p�[�g�i�[�i�z��҂��܂ށj,�P�D�t���^�C���i���Ј��j�ŏA�J�i���Z�Ζ������܂ށj,0,,,,,�Q�D�R�O�O���~�`�R�X�X���~,�Q�D��,�T�D20�N�ȏ�,�P�D���Y�w�i���񂪏��Y�j,�P�D���R����,�P�D�����Ƒ�����̋������߂�,�R�D���A��o�Y���Ă��Ȃ�,,�P�D���ɕ��S��������,�Q�D���Ȃ蕉�S��������,�Q�D���Ȃ蕉�S��������,�Q�D���Ȃ蕉�S��������,"�Q�D�D�P�m��f�@��i���f�j,�R�D�D�w���N�f���i�D�w���f�j�E���Y�t�O����,�U�D�ʉ@��ړ����̌�ʔ�i�^�N�V�[�j,�V�D�}�^�j�e�B�p�i��","�P�D���؎��̓��@�E���ؔ�,�Q�D�Y��P�A���@��,�T�D�ʉ@��ړ����̌�ʔ�i�^�N�V�[�j,�U�D���ނ�~���N�A�ߗޓ��̏��Ղ���玙�p�i��,�V�D�x�r�[�x�b�h��x�r�[�J�[���̕��i�̈玙�p�i��","�R�D�ʉ@��ړ����̌�ʔ�i�^�N�V�[�j,�S�D���ނ�~���N�A�ߗޓ��̏��Ղ���玙�p�i��,�T�D�x�r�[�x�b�h��x�r�[�J�[���̕��i�̈玙�p�i��",�R�D�ǂ���Ƃ������Ȃ�,"�S�D�D�P����i�D�P�W�����`�P�O�����j,�T�D�o�Y����`�P������,�U�D�o�Y��Q�����`�R������,�V�D�o�Y��S�����`�W������,�W�D�o�Y��X�����`�P�Q������","�P�D�̒��s�ǂ��J,�Q�D������玙�ɂ�鐇���s��,�R�D�Ԃ����̔���s��,�S�D�قڂЂƂ�ŁA�Ԃ����̈玙�����Ă���,�V�D�玙�Ɋւ��Ĉ�t����E�֑��k����ꏊ���Ȃ��E�v��������Ȃ�,�W�D�Ǝ��ƈ玙�̗���,�P�O�D�p�[�g�i�[�i�z��҂��܂ށj�Ƃ̉Ǝ��E�玙�̖������S,�P�Q�D�����I�Ȑ�����ւ̕s��",�R�D�ǂ���Ƃ������Ȃ�,"�V�D�o�Y��S�����`�W������,�W�D�o�Y��X�����`�P�Q������","�P�D�̒��s�ǁE��J�ŊO�o����@�����,�Q�D�Ǝ��E�玙�ɒǂ��ĊO�o����@�����,�R�D�قڂЂƂ�ň玙�����Ă���,�T�D����̈玙�Ɋւ��đ��k����ꏊ��l�����Ȃ��E�v��������Ȃ�,�U�D�玙�Ɋւ��Ĉ�t����E�֑��k����ꏊ���Ȃ��E�v��������Ȃ�,�V�D�Ζ���E�����Ƃ̐ړ_���������A�Љ�I�����E�𗬂�����,�W�D�e�E�e���E�F�l�ɑ��k������A��@����Ȃ�,�X�D�p�[�g�i�[�i�z��҂��܂ށj�̉Ǝ��E�玙�ւ̋��͂��R����",�T�D�Y���Ȃ�,,,,,�Q�D��╉�S��������,"�R�D�D�P�����i�D�P�T�����`�V�����j,�S�D�D�P����i�D�P�W�����`�P�O�����j,�V�D�o�Y��S�����`�W������","�P�D�������̕ω�,�Q�D�玙�ɂ���J�E�����s��,�S�D���o�Y���ꂽ���̑̒��s�ǁE�����^���s��,�X�D�e��e�����Ƃ̉Ǝ��E�玙�̉��l�ς̑���A�l�Ԋ֌W,�P�O�D�����I�Ȑ�����ւ̕s��",�T�D�S�������Ȃ�����,,,�R�D��L�P�`�Q�̂�����̐��x�����p���Ă��Ȃ��i�܂��͗��p�\�ȑΏۂł͂Ȃ������j,,,,,"�P�D�p�[�g�i�[�i�z��҂��܂ށj,�R�D�p�[�g�i�[�i�z��҂��܂ށj�̐e","�P�D�Ǝ��i�������E�H���E�|���E���󓙁j,�Q�D�Ԃ����̈玙,�T�D�Ԃ����E���傤�������̈ꎞ�a����","�U�D�Y��P�A�i�ʂ��^�f�C�P�A�A�h���E�V���[�g�X�e�C�A���Y�t�K�ⓙ�j,�X�D�x�r�[�x�b�h��x�r�[�J�[���̈玙�p�i�����^��,�P�O�D�ړ��x���i�D�w�x���^�N�V�[�A�}�}�T�|�[�g�^�N�V�[���j","�P�D�Ǝ���s�i�������E�H���E�|���E���󓙁j,�T�D�x�r�[�V�b�^�[,�U�D�ۈ珊�E�w�Z�E�K�����Ƃ̑��},�W�D�Y��P�A�i�ʂ��^�f�C�P�A�A�h���E�V���[�g�X�e�C�A���Y�t�K�ⓙ�j,�X�D����̈玙���k�E�J�E���Z�����O�i�I�����C���܂ށj,�P�O�D��t�E���E�̈玙���k�E�J�E���Z�����O�i�I�����C���܂ށj,�P�P�D�x�r�[�x�b�h��x�r�[�J�[���̈玙�p�i�����^��",�Q�D��₻���v��,"�R�D�q�ǂ��ƍs����ꏊ�i�V�y�n�E���X���j�����Ȃ�,�T�D�}篂̑Ή��ŗ�������ꏊ�⋒�_�����Ȃ��i�}�Ȃ��ނς��E�������j,�U�D���H�E�����������E��Ȃ��Ɗ�����,�X�D�x�r�[�J�[�ł̊O�o�E�ړ��ɂ����āA�s�ւ�������,�P�O�D�q�ǂ��ƊO�o�ł���ꏊ�E�V�ׂ�ꏊ�₨�X�̏�񂪏��Ȃ�,�P�P�D���Ǝ{�݁E�����{�ݓ��̎q�ǂ��A�ꂪ���p���₷���{�݈ē������Ȃ��i�x�r�[�J�[�u����E�ݏo�A�������A�q�ǂ���p�X�y�[�X���j,�P�Q�D��ԁE�[�铙�̎q�ǂ��ً̋}���i�}�ȑ̒��s�ǂȂǁj�̈ړ���i�����Ȃ�","�P�D���l�s�i������j�z�[���y�[�W,�Q�D���l�s�̍L�񎆁A�`���V�A���q��,�S�D�D�P�E�o�Y�E�q��Ċ֘A�̖��Ԋ�Ɠ��̃E�F�u�T�C�g,�T�D�D�P�E�o�Y�E�q��Ċ֘A�̖��Ԋ�Ɠ��̃A�v��,�U�DInstagram�i�C���X�^�O�����j,�V�DTwitter�i�c�C�b�^�[�j,�X�DYouTube�i���[�`���[�u�j,�P�P�D�m�l�A�F�l",�R�D���͍l�����Ȃ�,"�P�D���݂̎q��ĂŐ���t,�Q�D�����I�Ȉ玙�ւ̕s��,�T�D�����I�Ȑ�����E�q�ǂ��̋����,�U�D�����I�ȏZ����E�Z���X�y�[�X���L���ꏊ�ւ̏Z�ւ�,�X�D�p�[�g�i�[�i�z��҂��܂ށj�Ƃ̉Ǝ��E�玙�̖������S,�P�O�D������v�w�̎��Ԋm��",���ؔ�p�̕ی��K�p,�P�D���o�Y���ꂽ��
8,�U��,�S�D30�΁`34��,�P�D�t���^�C���i���Ј��j�ŏA�J�i���Z�Ζ������܂ށj,"�P�D�p�[�g�i�[�i�z��҂��܂ށj,�Q�D�q�ǂ��i����o�Y���ꂽ���q����ȊO�j",�P�D�t���^�C���i���Ј��j�ŏA�J�i���Z�Ζ������܂ށj,1,�Q�D�ۈ牀���^�c�t�����^�F�肱�ǂ�����,,,,�X�D�P�C�O�O�O���~�`�P�C�Q�S�X���~,�V�D�`��,�S�D10�`20�N����,�Q�D�o�Y�w�i�ߋ��ɏo�Y�o��������j,�P�D���R����,"�P�D�����Ƒ�����̋������߂�,�R�D�{�݂̒m���x�E���R�~�E�]��,�U�D���������o�Y�E�t���Y�����@���\",�R�D���A��o�Y���Ă��Ȃ�,,�Q�D��╉�S��������,�Q�D���Ȃ蕉�S��������,�R�D��╉�S��������,�R�D��╉�S��������,"�Q�D�D�P�m��f�@��i���f�j,�R�D�D�w���N�f���i�D�w���f�j�E���Y�t�O����,�X�D���e������̃T�|�[�g�ɂ������p�i��ʔ�E������j�i��D���A��o�Y�̂��߂̋A�ȁA�ꎞ�I�ȌĂъ񂹂ɂ�铯���Ȃǁj","�P�D���؎��̓��@�E���ؔ�,�R�D�Y�w���N�f����i�Y�w���f�j,�U�D���ނ�~���N�A�ߗޓ��̏��Ղ���玙�p�i��,�V�D�x�r�[�x�b�h��x�r�[�J�[���̕��i�̈玙�p�i��",�S�D���ނ�~���N�A�ߗޓ��̏��Ղ���玙�p�i��,�S�D���܂蕉�S�������Ȃ�����,"�Q�D�D�P�����i�D�P�P�����`�S�����j,�S�D�D�P����i�D�P�W�����`�P�O�����j,�T�D�o�Y����`�P������","�P�D�̒��s�ǂ��J,�Q�D������玙�ɂ�鐇���s��,�W�D�Ǝ��ƈ玙�̗���",�T�D�S�������Ȃ�����,,,"�P�D�Y�O�x�Ɛ��x�𗘗p����,�Q�D�玙�x�Ɛ��x�𗘗p�����E���Ă���,�R�D�Ζ���̋x�ɐ��x�𗘗p�����E���Ă���i���ʋx�ɁE�L���x�ɓ��j",�S�D�P�W�����ȏ�Q�S��������,�P�D�\�肵�Ă������Ԃł���,,,�T�D�S�����S�������Ȃ�����,,,�T�D�S�������Ȃ�����,,,�Q�D�Ζ���̋x�ɐ��x�𗘗p�����E���Ă���i���ʋx�ɁE�L���x�ɓ��j,�Q�D�T���`�Q�T�Ԗ���,�P�D�\�肵�Ă������Ԃł���,,,"�P�D�p�[�g�i�[�i�z��҂��܂ށj,�Q�D���o�Y���ꂽ���̐e,�R�D�p�[�g�i�[�i�z��҂��܂ށj�̐e","�P�D�Ǝ��i�������E�H���E�|���E���󓙁j,�Q�D�Ԃ����̈玙,�R�D���傤�������̈玙,�S�D���}�E�ړ�,�T�D�Ԃ����E���傤�������̈ꎞ�a����,�U�D�玙�Ɋւ��鑊�k",�P�R�D���p���Ă��Ȃ�,"�Q�D�H�ޑ�z�T�[�r�X�i�~�[���L�b�g�Ȃǂ̊Ȉ՗����H�ނ̃Z�b�g���j,�R�D��H�T�[�r�X�i�①�E�Ⓚ�ٓ��A����u�����������j",�Q�D��₻���v��,"�P�D�q�A��O�o�ւ̎��̗͂������R����,�Q�D������ʋ@�ւ𗘗p����ۂ̎��̗͂������R����","�P�D���l�s�i������j�z�[���y�[�W,�Q�D���l�s�̍L�񎆁A�`���V�A���q��,�S�D�D�P�E�o�Y�E�q��Ċ֘A�̖��Ԋ�Ɠ��̃E�F�u�T�C�g,�T�D�D�P�E�o�Y�E�q��Ċ֘A�̖��Ԋ�Ɠ��̃A�v��,�U�DInstagram�i�C���X�^�O�����j,�X�DYouTube�i���[�`���[�u�j,�P�P�D�m�l�A�F�l,�P�T�D�ۈ珊�E�c�t���E�F�肱�ǂ�����",�Q�D�����v��Ȃ�,"�P�D���݂̎q��ĂŐ���t,�Q�D�����I�Ȉ玙�ւ̕s��,�T�D�����I�Ȑ�����E�q�ǂ��̋����,�U�D�����I�ȏZ����E�Z���X�y�[�X���L���ꏊ�ւ̏Z�ւ�,�P�O�D������v�w�̎��Ԋm��",�ۈ痿��0�Ύ����疳���ɂ��Ă��炦��ƌo�ϓI���S���y������̂ł��Ђ������������B �ۈ牀��0�Ύ�����\�����܂Ȃ���΋󂫂��Ȃ�����Ȃ��̂�3�Ύ�����ł�����ɗ]�T������A�ۈ牀�ɓ����悤�ɂȂ�ƈ�x��3�N���₷���Ȃ�̂ŕۈ牀�𑝂₵�ė~�����ł��B ���w�Z�̋��H��ٓ��`���ł͂Ȃ��A�{���̋��H�ɂ��ė~�����ł��B,�P�D���o�Y���ꂽ��