�@�l���̎��,�@�l���̖���(�ӂ肪��),�@�l���̖���,�@�l���̎傽�鎖�����̏��ݒn_�X�֔ԍ�,�@�l���̎傽�鎖�����̏��ݒn_�s���{��,�@�l���̎傽�鎖�����̏��ݒn_�s�撬��,�@�l���̎傽�鎖�����̏��ݒn_�����E�Ԓn,�@�l���̎傽�鎖�����̏��ݒn_�������E�����ԍ���,�@�l���̘A����_�d�b�ԍ�,�@�l���̘A����_���̑��A����,���ƎҔԍ�,�@�l������E�ۈ��񋟂��A���͒񋟂��悤�Ƃ���{�ݓ��̏��ݒn���Ǌ�����s���{���̋����ɏ��݂��铖�Y�@�l���ݒu���鋳��E�ۈ�{�݋y�ѓ��Y�@�l���s���n��^�ۈ玖��,�{�ݗތ^,�{�݂̖���(�ӂ肪��),�{�݂̖���,���Ə��ԍ�,�X�֔ԍ�,�{�݂̏��ݒn �s���{��,�{�݂̏��ݒn �s�撬��,�{�݂̏��ݒn �����E�Ԓn,�{�݂̏��ݒn �������E�����ԍ���,�{�݂̘A���� �d�b�ԍ�,�{�݂̘A���� ���̑��A����,���Ƃ̔F�N����,���Ƃ̊J�n�N����,���Ƃ̊m�F�N����,�A�g�{��(01)_�A�g��{�ݖ�,�A�g�{��(01)_�A�g���e,�A�g�{��(02)_�A�g��{�ݖ�,�A�g�{��(02)_�A�g���e,�A�g�{��(03)_�A�g��{�ݖ�,�A�g�{��(03)_�A�g���e,�A�g�{��(04)_�A�g��{�ݖ�,�A�g�{��(04)_�A�g���e,�A�g�{��(05)_�A�g��{�ݖ�,�A�g�{��(05)_�A�g���e,�A�g�{��(06)_�A�g��{�ݖ�,�A�g�{��(06)_�A�g���e,�A�g�{��(07)_�A�g��{�ݖ�,�A�g�{��(07)_�A�g���e,�A�g�{��(08)_�A�g��{�ݖ�,�A�g�{��(08)_�A�g���e,�A�g�{��(09)_�A�g��{�ݖ�,�A�g�{��(09)_�A�g���e,�A�g�{��(10)_�A�g��{�ݖ�,�A�g�{��(10)_�A�g���e,�A�g�{��(11)_�A�g��{�ݖ�,�A�g�{��(11)_�A�g���e,�A�g�{��(12)_�A�g��{�ݖ�,�A�g�{��(12)_�A�g���e,�A�g�{��(13)_�A�g��{�ݖ�,�A�g�{��(13)_�A�g���e,�A�g�{��(14)_�A�g��{�ݖ�,�A�g�{��(14)_�A�g���e,�A�g�{��(15)_�A�g��{�ݖ�,�A�g�{��(15)_�A�g���e,�A�g�{��(16)_�A�g��{�ݖ�,�A�g�{��(16)_�A�g���e,�A�g�{��(17)_�A�g��{�ݖ�,�A�g�{��(17)_�A�g���e,�A�g�{��(18)_�A�g��{�ݖ�,�A�g�{��(18)_�A�g���e,�A�g�{��(19)_�A�g��{�ݖ�,�A�g�{��(19)_�A�g���e,�A�g�{��(20)_�A�g��{�ݖ�,�A�g�{��(20)_�A�g���e,�A�g�{��(21)_�A�g��{�ݖ�,�A�g�{��(21)_�A�g���e,�A�g�{��(22)_�A�g��{�ݖ�,�A�g�{��(22)_�A�g���e,�A�g�{��(23)_�A�g��{�ݖ�,�A�g�{��(23)_�A�g���e,�A�g�{��(24)_�A�g��{�ݖ�,�A�g�{��(24)_�A�g���e,�A�g�{��(25)_�A�g��{�ݖ�,�A�g�{��(25)_�A�g���e,�A�g�{��(26)_�A�g��{�ݖ�,�A�g�{��(26)_�A�g���e,�A�g�{��(27)_�A�g��{�ݖ�,�A�g�{��(27)_�A�g���e,�A�g�{��(28)_�A�g��{�ݖ�,�A�g�{��(28)_�A�g���e,�A�g�{��(29)_�A�g��{�ݖ�,�A�g�{��(29)_�A�g���e,�A�g�{��(30)_�A�g��{�ݖ�,�A�g�{��(30)_�A�g���e,�A�g�{��(31)_�A�g��{�ݖ�,�A�g�{��(31)_�A�g���e,�A�g�{��(32)_�A�g��{�ݖ�,�A�g�{��(32)_�A�g���e,�A�g�{��(33)_�A�g��{�ݖ�,�A�g�{��(33)_�A�g���e,�A�g�{��(34)_�A�g��{�ݖ�,�A�g�{��(34)_�A�g���e,�A�g�{��(35)_�A�g��{�ݖ�,�A�g�{��(35)_�A�g���e,�A�g�{��(36)_�A�g��{�ݖ�,�A�g�{��(36)_�A�g���e,�A�g�{��(37)_�A�g��{�ݖ�,�A�g�{��(37)_�A�g���e,�A�g�{��(38)_�A�g��{�ݖ�,�A�g�{��(38)_�A�g���e,�A�g�{��(39)_�A�g��{�ݖ�,�A�g�{��(39)_�A�g���e,�A�g�{��(40)_�A�g��{�ݖ�,�A�g�{��(40)_�A�g���e,�A�g�{��(41)_�A�g��{�ݖ�,�A�g�{��(41)_�A�g���e,�A�g�{��(42)_�A�g��{�ݖ�,�A�g�{��(42)_�A�g���e,�A�g�{��(43)_�A�g��{�ݖ�,�A�g�{��(43)_�A�g���e,�A�g�{��(44)_�A�g��{�ݖ�,�A�g�{��(44)_�A�g���e,�A�g�{��(45)_�A�g��{�ݖ�,�A�g�{��(45)_�A�g���e,�A�g�{��(46)_�A�g��{�ݖ�,�A�g�{��(46)_�A�g���e,�A�g�{��(47)_�A�g��{�ݖ�,�A�g�{��(47)_�A�g���e,�A�g�{��(48)_�A�g��{�ݖ�,�A�g�{��(48)_�A�g���e,�A�g�{��(49)_�A�g��{�ݖ�,�A�g�{��(49)_�A�g���e,�A�g�{��(50)_�A�g��{�ݖ�,�A�g�{��(50)_�A�g���e,�A�g�{��(51)_�A�g��{�ݖ�,�A�g�{��(51)_�A�g���e,�A�g�{��(52)_�A�g��{�ݖ�,�A�g�{��(52)_�A�g���e,�A�g�{��(53)_�A�g��{�ݖ�,�A�g�{��(53)_�A�g���e,�A�g�{��(54)_�A�g��{�ݖ�,�A�g�{��(54)_�A�g���e,�A�g�{��(55)_�A�g��{�ݖ�,�A�g�{��(55)_�A�g���e,�A�g�{��(56)_�A�g��{�ݖ�,�A�g�{��(56)_�A�g���e,�A�g�{��(57)_�A�g��{�ݖ�,�A�g�{��(57)_�A�g���e,�A�g�{��(58)_�A�g��{�ݖ�,�A�g�{��(58)_�A�g���e,�A�g�{��(59)_�A�g��{�ݖ�,�A�g�{��(59)_�A�g���e,�A�g�{��(60)_�A�g��{�ݖ�,�A�g�{��(60)_�A�g���e,�A�g�{��(61)_�A�g��{�ݖ�,�A�g�{��(61)_�A�g���e,�A�g�{��(62)_�A�g��{�ݖ�,�A�g�{��(62)_�A�g���e,�A�g�{��(63)_�A�g��{�ݖ�,�A�g�{��(63)_�A�g���e,�A�g�{��(64)_�A�g��{�ݖ�,�A�g�{��(64)_�A�g���e,�A�g�{��(65)_�A�g��{�ݖ�,�A�g�{��(65)_�A�g���e,�A�g�{��(66)_�A�g��{�ݖ�,�A�g�{��(66)_�A�g���e,�A�g�{��(67)_�A�g��{�ݖ�,�A�g�{��(67)_�A�g���e,�A�g�{��(68)_�A�g��{�ݖ�,�A�g�{��(68)_�A�g���e,�A�g�{��(69)_�A�g��{�ݖ�,�A�g�{��(69)_�A�g���e,�A�g�{��(70)_�A�g��{�ݖ�,�A�g�{��(70)_�A�g���e,�A�g�{��(71)_�A�g��{�ݖ�,�A�g�{��(71)_�A�g���e,�A�g�{��(72)_�A�g��{�ݖ�,�A�g�{��(72)_�A�g���e,�A�g�{��(73)_�A�g��{�ݖ�,�A�g�{��(73)_�A�g���e,�A�g�{��(74)_�A�g��{�ݖ�,�A�g�{��(74)_�A�g���e,�A�g�{��(75)_�A�g��{�ݖ�,�A�g�{��(75)_�A�g���e,�A�g�{��(76)_�A�g��{�ݖ�,�A�g�{��(76)_�A�g���e,�A�g�{��(77)_�A�g��{�ݖ�,�A�g�{��(77)_�A�g���e,�A�g�{��(78)_�A�g��{�ݖ�,�A�g�{��(78)_�A�g���e,�A�g�{��(79)_�A�g��{�ݖ�,�A�g�{��(79)_�A�g���e,�A�g�{��(80)_�A�g��{�ݖ�,�A�g�{��(80)_�A�g���e,�A�g�{��(81)_�A�g��{�ݖ�,�A�g�{��(81)_�A�g���e,�A�g�{��(82)_�A�g��{�ݖ�,�A�g�{��(82)_�A�g���e,�A�g�{��(83)_�A�g��{�ݖ�,�A�g�{��(83)_�A�g���e,�A�g�{��(84)_�A�g��{�ݖ�,�A�g�{��(84)_�A�g���e,�A�g�{��(85)_�A�g��{�ݖ�,�A�g�{��(85)_�A�g���e,�A�g�{��(86)_�A�g��{�ݖ�,�A�g�{��(86)_�A�g���e,�A�g�{��(87)_�A�g��{�ݖ�,�A�g�{��(87)_�A�g���e,�A�g�{��(88)_�A�g��{�ݖ�,�A�g�{��(88)_�A�g���e,�A�g�{��(89)_�A�g��{�ݖ�,�A�g�{��(89)_�A�g���e,�A�g�{��(90)_�A�g��{�ݖ�,�A�g�{��(90)_�A�g���e,�A�g�{��(91)_�A�g��{�ݖ�,�A�g�{��(91)_�A�g���e,�A�g�{��(92)_�A�g��{�ݖ�,�A�g�{��(92)_�A�g���e,�A�g�{��(93)_�A�g��{�ݖ�,�A�g�{��(93)_�A�g���e,�A�g�{��(94)_�A�g��{�ݖ�,�A�g�{��(94)_�A�g���e,�A�g�{��(95)_�A�g��{�ݖ�,�A�g�{��(95)_�A�g���e,�A�g�{��(96)_�A�g��{�ݖ�,�A�g�{��(96)_�A�g���e,�A�g�{��(97)_�A�g��{�ݖ�,�A�g�{��(97)_�A�g���e,�A�g�{��(98)_�A�g��{�ݖ�,�A�g�{��(98)_�A�g���e,�A�g�{��(99)_�A�g��{�ݖ�,�A�g�{��(99)_�A�g���e,�ۈ狳�@_�]�ƎҐ�_���,�ۈ狳�@_�]�ƎҐ�_����,�ۈ狳�@_�J������,�ۈ狳�@_���όo���N��_���,�ۈ狳�@_���όo���N��_����,���@���͕ۈ�m_�]�ƎҐ�_���,���@���͕ۈ�m_�]�ƎҐ�_����,���@���͕ۈ�m_�J������,���@���͕ۈ�m_���όo���N��_���,���@���͕ۈ�m_���όo���N��_����,�ۈ�m_�]�ƎҐ�_���,�ۈ�m_�]�ƎҐ�_����,�ۈ�m_�J������,�ۈ�m_���όo���N��_���,�ۈ�m_���όo���N��_����,�ۈ�]����_�]�ƎҐ�_���,�ۈ�]����_�]�ƎҐ�_����,�ۈ�]����_�J������,�ۈ�]����_���όo���N��_���,�ۈ�]����_���όo���N��_����,���@_�]�ƎҐ�_���,���@_�]�ƎҐ�_����,���@_�J������,���@_���όo���N��_���,���@_���όo���N��_����,�ƒ�I�ۈ�� ���͉ƒ�I�ۈ�⏕��_�]�ƎҐ�_���,�ƒ�I�ۈ�� ���͉ƒ�I�ۈ�⏕��_�]�ƎҐ�_����,�ƒ�I�ۈ�� ���͉ƒ�I�ۈ�⏕��_�J������,�ƒ�I�ۈ�� ���͉ƒ�I�ۈ�⏕��_���όo���N��_���,�ƒ�I�ۈ�� ���͉ƒ�I�ۈ�⏕��_���όo���N��_����,���v_�]�ƎҐ�_���,���v_�]�ƎҐ�_����,�E����l������̎q�ǂ��̐�,�L����Ƌ��E���i,�L����Ƌ��E���i_���̑�,�J����_�J���j��,�J����_�����J������,�J����_����������,�J����_�y�j���J������,�J����_�y�j��������,�J����_���j���J������,�J����_���j��������,�J������2��3��_�W�����ԕ����J�n����,�J������2��3��_�W�����ԕ����I������,�J������2��3��_�W�����ԓy�j�J�n����,�J������2��3��_�W�����ԓy�j�I������,�J������2��3��_�Z���ԕ����J�n����,�J������2��3��_�Z���ԕ����I������,�J������2��3��_�Z���ԓy�j�J�n����,�J������2��3��_�Z���ԓy�j�I������,�a����ۈ玞��_�����J��,�a����ۈ玞��_������,�a����ۈ玞��_�y�j���J��,�a����ۈ玞��_�y�j����,�a����ۈ玞��_���j���J��,�a����ۈ玞��_���j����,0��_���p�����,0��_���p�Ґ�,0��_�w����,1��_���p�����,1��_���p�Ґ�,1��_�w����,2��_���p�����,2��_���p�Ґ�,2��_�w����,3��_���p�����,3��_���p�Ґ�,3��_�w����,4��_���p�����,4��_���p�Ґ�,4��_�w����,5��_���p�����,5��_���p�Ґ�,5��_�w����,���v_���p�����,���v_���p�Ґ�,���v_�w����,����J�n�N��R�[�h�i���́j,�^�c���@,����E�ۈ�̓��e��,���H�̎��{��_���{��,���H�̎��{��_�񋟓�,��Q���̎󂯓���̐�,�ꎞ�a���莖�Ƃ̎��{,�a���ۈ玖�Ƃ̎��{,���p�葱��,�I�l�,���̑��̗��p,���ɑ΂��鑋����,�������ׂ����̂ւ̑Ή�,�񋟓��e�̓��F,���p��_�����_������̗L��,���p��_�����_���R,���p��_�����_���z,���p��_��悹����_��悹�����̗L��,���p��_��悹����_���R,���p��_��悹����_���z,�񋟊J�n���̐���,���p�҂̓���,���p�ҕ��S�̗��p���Ɋւ������,���k�A���̑Ή��̂��߂̎�g,���̔����̖h�~�y�є������̑Ή�,�l��񓙂̎�g��,��O�ҕ]�����̎��{�E���ʂ̌��\��,��O�ҕ]�����̌���
�w�Z�@�l,���������ق�����@���Ȃ��킯�񂶂イ�����ӂ�����������,�w�Z�@�l�@�_�ސ쌧�Z����w��,2350022,�_�ސ쌧,���l�s��q��,������P�|�U,,,,1.41E+12,,�c�t���|�V���x��,�����݂������イ�����悤������,�����䒆���c�t��,1.41E+12,2350022,�_�ސ쌧,���l�s��q��,������Q�|�W,,,,,,,,,,,,,,,,,,,,,,,,,,,,,,,,,,,,,,,,,,,,,,,,,,,,,,,,,,,,,,,,,,,,,,,,,,,,,,,,,,,,,,,,,,,,,,,,,,,,,,,,,,,,,,,,,,,,,,,,,,,,,,,,,,,,,,,,,,,,,,,,,,,,,,,,,,,,,,,,,,,,,,,,,,,,,,,,,,,,,,,,,,,,,,,,,,,,,,,,,,,,,,,,,,,,,,,,,,,,,,,,,,,,,,,,,,,,,,,,,,,,,,,,,,,,,,,,,,,,,,,,,,,,,,65,,,60,,,85,,,210,,,�R��,,,,,,,,,,,,,,,,,,,,,,,,,,,
�w�Z�@�l,���������ق�����@���Ȃ��킯�񂶂イ�����ӂ�����������,�w�Z�@�l�@�_�ސ쌧�Z����w��,2350022,�_�ސ쌧,���l�s��q��,������P�|�U,,,,1.41E+12,,�c�t���|�V���x��,������܂悤������,�|�R�c�t��,1.41E+12,2260005,�_�ސ쌧,���l�s�΋�,�|�R�Q���ڂS�ԂP,,,,,,,,,,,,,,,,,,,,,,,,,,,,,,,,,,,,,,,,,,,,,,,,,,,,,,,,,,,,,,,,,,,,,,,,,,,,,,,,,,,,,,,,,,,,,,,,,,,,,,,,,,,,,,,,,,,,,,,,,,,,,,,,,,,,,,,,,,,,,,,,,,,,,,,,,,,,,,,,,,,,,,,,,,,,,,,,,,,,,,,,,,,,,,,,,,,,,,,,,,,,,,,,,,,,,,,,,,,,,,,,,,,,,,,,,,,,,,,,,,,,,,,,,,,,,,,,,,,,,,,,,,,,,,30,,,30,,,30,,,90,,,�R��,,,,,,,,,,,,,,,,,,,,,,,,,,,
�w�Z�@�l,���������ق�����@���Ȃ��킯�񂶂イ�����ӂ�����������,�w�Z�@�l�@�_�ސ쌧�Z����w��,2350022,�_�ސ쌧,���l�s��q��,������P�|�U,,,,1.41E+12,,�c�t���|�V���x��,�����݂����Ђ����悤������,�����䓌�c�t��,1.41E+12,2350022,�_�ސ쌧,���l�s��q��,������Q���ڂP�Ԓn,,,,,,,,,,,,,,,,,,,,,,,,,,,,,,,,,,,,,,,,,,,,,,,,,,,,,,,,,,,,,,,,,,,,,,,,,,,,,,,,,,,,,,,,,,,,,,,,,,,,,,,,,,,,,,,,,,,,,,,,,,,,,,,,,,,,,,,,,,,,,,,,,,,,,,,,,,,,,,,,,,,,,,,,,,,,,,,,,,,,,,,,,,,,,,,,,,,,,,,,,,,,,,,,,,,,,,,,,,,,,,,,,,,,,,,,,,,,,,,,,,,,,,,,,,,,,,,,,,,,,,,,,,,,,,90,,,90,,,90,,,270,,,�R��,,,,,,,,,,,,,,,,,,,,,,,,,,,
�w�Z�@�l,�悱�͂܂�܂Ă�������,���l�R��w��,2310024,�_�ސ쌧,���l�s����,�g�l���Q�ԂU�U��,,,,1.41E+12,,�c�t���|�V���x��,�ς񂾂悤������,�F�L�i�p���_�j�c�t��,1.41E+12,2310024,�_�ސ쌧,���l�s����,�g�l���Q�ԂU�U��,,,,2021/4/1,,,,,,,,,,,,,,,,,,,,,,,,,,,,,,,,,,,,,,,,,,,,,,,,,,,,,,,,,,,,,,,,,,,,,,,,,,,,,,,,,,,,,,,,,,,,,,,,,,,,,,,,,,,,,,,,,,,,,,,,,,,,,,,,,,,,,,,,,,,,,,,,,,,,,,,,,,,,,,,,,,,,,,,,,,,,,,,,,,,,,,,,,,,,,,,,,,,,,,,,,,,,,,,,,,,,,,,,,,,,,,,,,,,,,,,,,,,,,,,,,,,,,,,,,,,,,,,,,,,,,,,,,,40,,,40,,,40,,,120,,,�R��,,,,,,,,,,,,,,,,,,,,,,,,,,,
�w�Z�@�l,���������ق�����@���Ȃ��킯�񂶂イ�����ӂ�����������,�w�Z�@�l�@�_�ސ쌧�Z����w��,2350022,�_�ސ쌧,���l�s��q��,������P�|�U,,,,1.41E+12,,�c�t���|�V���x��,������܂݂Ȃ݂悤������,�|�R��c�t��,1.41E+12,2260005,�_�ސ쌧,���l�s�΋�,�|�R�R���ڂP�ԂT,,,,,,,,,,,,,,,,,,,,,,,,,,,,,,,,,,,,,,,,,,,,,,,,,,,,,,,,,,,,,,,,,,,,,,,,,,,,,,,,,,,,,,,,,,,,,,,,,,,,,,,,,,,,,,,,,,,,,,,,,,,,,,,,,,,,,,,,,,,,,,,,,,,,,,,,,,,,,,,,,,,,,,,,,,,,,,,,,,,,,,,,,,,,,,,,,,,,,,,,,,,,,,,,,,,,,,,,,,,,,,,,,,,,,,,,,,,,,,,,,,,,,,,,,,,,,,,,,,,,,,,,,,,,,,40,,,40,,,40,,,120,,,�R��,,,,,,,,,,,,,,,,,,,,,,,,,,,
�w�Z�@�l,���������ق����񂽂��͂���������,�w�Z�@�l�����w��,2270044,�_�ސ쌧,���l�s�t��,��������P�T�]�S,,045-973-5738,,1.41E+12,�Ȃ�,�c�t���|�V���x��,�������̂悤������,��������c�t��,1.41E+12,2270044,�_�ސ쌧,���l�s�t��,��������P�T�|�S,,045-973-5738,,,1972/3/8,1972/4/1,�p���b�g�ƒ�I�ۈ玺�@�ȂȂ���,"���O�V�Z��̗��p�Ɋւ���x��,�����ۈ�Ɋւ���x��,����x��,�s���ւ̎Q���Ɋւ���x��,������̎󂯎M�Ƃ��Ă̎x��",,,,,,,,,,,,,,,,,,,,,,,,,,,,,,,,,,,,,,,,,,,,,,,,,,,,,,,,,,,,,,,,,,,,,,,,,,,,,,,,,,,,,,,,,,,,,,,,,,,,,,,,,,,,,,,,,,,,,,,,,,,,,,,,,,,,,,,,,,,,,,,,,,,,,,,,,,,,,,,,,,,,,,,,,,,,,,,,,,,,,,,,,,,,,,,,,,,,,,,,,,,,,,,,,,,,,,,,,17,10,8,8,11,,,,,,17,10,7,"�ۈ�m���i,�c�t�����@�Ƌ�",,,,,,,,,,,,,,,,,7:30,18:30,,,,,,,,,,,,,,70,,,70,,,70,,,210,,,�R��,���w�̐��_�u�c�����ɂӂ��킵�����R�̌���l�X�Ȋ�����ʂ��āA�l�Ƃ��Đ�����L���ȐS�ƌ��₩�ȑ̂���Ă�v���ڍׂ�HP��聤https://www.moegino.ed.jp/policy/,�c�����́A�S�ɐl�Ƃ��ĖL���Ȑl��̍��𒣂��؂Ȏ����ł���Ǝ󂯎~�߁A�u���N�Ŗ��邭�A�̂т̂тƖL���ȐS�Ɛ�����͂���ށv���Ƃ����痝�O�Ƃ��Ă���܂��B�l�G�܁X�̎��R��F�����A�ۈ�҂Ƃ̂ӂꂠ���̒��ŗV�т𒆐S�Ƃ��������I�ȕۈ�̓W�J��ڎw���܂��B���ڍׂ�HP��聤https://www.moegino.ed.jp/,���H�E�ٓ����p,"���j��,�Ηj��,���j��,�ؗj��,���j��",����,����,�Ȃ�,�����̌�t�i�X���܂��͐�����ł̔z�z���j,���O�A��{���j���Ɋ�Â��I�l,,�������ӔC�ҁF���������������S���F�������A�������A�w�N��C��������O�҈ψ��F������y�ѕ]�c����,"�����ۏ�ΐl1���ɂ�/1,000,000,000�~�ΐl1���̂ɂ�/4,000,000,000�~",�G�߂��ƂɁA�w���̔_���ł̂������E�݂₶�Ⴊ�����@��A�`�����A���܈��@�蓙�̎��n���y���݁A����ł̂Ԃǂ����Ȃǎ��R�ɐe���ޕۈ��W�J���Ă���܂��B�܂��A��������̎�Ŏ���܂��A��ĂĂ����g�E�����R�V�A�A�T�K�I�A�����낢�ԁA���₦��ǂ��͔|�́A���R�̕s�v�c����̑傳�A���������܊��Ŋ������A��ɋ����Ɗ�����^���Ă���܂��B���̂悤�Ȍb�܂ꂽ���R�̊��ƗF�B��ۈ�҂Ƃ̂ӂꂠ���̒��ŁA�c���̎�̓I�Ȋ����𑣂��A�V�т𒆐S�Ƃ��������I�ȕۈ���d�����Ă���܂��B������A�q�ǂ������̌��𑸏d���A�S�g�̔��B�𑣂��A�L���Ȑl�Ԑ��̈琬�ɓw�߂Ă����܂��B,����,"�{�ݐݔ���U�i�X�N�[���o�X�^�s�ɌW���p�����p�҂̂݁j�F54,000�~/�N�G�{��F5,400�~/�N�ۈ狳�ޔ�i�X�Ŏg�����́j�F3,280�~/�N�s����i�����㓙�j�F4,880�~/�N�����A���o���A�L�O�i�F7,500�~/�N�����̂�",75060,����,"�{�ݐݔ���T�i�{�݂̈ێ��Ǘ��ɌW���p�j�F30,000�~/�N���ޔ�i�����������Ŏg�����́j�F9,600�~��g�[��i4�C5���������j�F6,000�~/�N",45600,����,����,����,"���k�A����t�����̐ݒu,���k�A�����e�̋L�^,���k�A���Ɋւ���s�������{���Ƃւ̋���,���P���ʂ̎s�����ւ̕�","���̔������̑Ή��y�ю��̔����h�~�̂��߂̎w�j�̐���,���̔������̕񍐋y�щ��P������m�O�ꂷ��̐��̐���,���̔����h�~�̂��߂̒���I�Ȍ��C�̎��{","�閧�ێ��ɌW��K���̐���,�閧�ێ��ɌW�錤�C�̎��{",�����{,
�w�Z�@�l,���Ȃ��킪������,�_�ސ�w��,2310021,�_�ސ쌧,���l�s����,���{���1,,045-210-1111,045-210-1111,1.41E+12,,�c�t���|�V���x��,���Ȃ���悤������,�_�ސ�c�t��,1.41E+12,2310021,�_�ސ쌧,���l�s����,���{���1,,045-210-1111,045-210-1111,2021/1/1,,,,,,,,,,,,,,,,,,,,,,,,,,,,,,,,,,,,,,,,,,,,,,,,,,,,,,,,,,,,,,,,,,,,,,,,,,,,,,,,,,,,,,,,,,,,,,,,,,,,,,,,,,,,,,,,,,,,,,,,,,,,,,,,,,,,,,,,,,,,,,,,,,,,,,,,,,,,,,,,,,,,,,,,,,,,,,,,,,,,,,,,,,,,,,,,,,,,,,,,,,,,,,,,,,,,,,,,,,,,,,,,,,,,,,,,,,,,"���j��,���j��,�Ηj��,���j��,�ؗj��,���j��,�y�j��,�j��",8:30,17:15,8:30,17:15,8:30,17:15,#N/A,#N/A,#N/A,#N/A,#N/A,#N/A,#N/A,#N/A,,,,,,,1,,,1,,,1,,,1,,,1,,,1,,,6,,,#N/A,,,,,,,,,,,,,,,,,,,,,,,,,,,
�w�Z�@�l,���������ق�����@�ł񂦂�Ƃ���������,�w�Z�@�l�@�c���s�s�w��,2270054,�_�ސ쌧,���l�s�t��,����Ƃ��U�Q�|�P�S,,,,1.41E+12,,�c�t���|�V���x��,�ł񂦂�Ƃ��悤������,�c���s�s�c�t��,1.41E+12,2270054,�_�ސ쌧,���l�s�t��,����Ƃ��U�Q�|�P�S,,,,,,,,,,,,,,,,,,,,,,,,,,,,,,,,,,,,,,,,,,,,,,,,,,,,,,,,,,,,,,,,,,,,,,,,,,,,,,,,,,,,,,,,,,,,,,,,,,,,,,,,,,,,,,,,,,,,,,,,,,,,,,,,,,,,,,,,,,,,,,,,,,,,,,,,,,,,,,,,,,,,,,,,,,,,,,,,,,,,,,,,,,,,,,,,,,,,,,,,,,,,,,,,,,,,,,,,,,,,,,,,,,,,,,,,,,,,,,,,,,,,,,,,,,,,,,,,,,,,,,,,,,,,,,60,,,60,,,60,,,180,,,�R��,,,,,,,,,,,,,,,,,,,,,,,,,,,
�w�Z�@�l,��������������,�����w��,2410005,�_�ސ쌧,���l�s�΋�,�����Q�|�R�S�|�V,,045-951-0156,045-951-0183,1.41E+12,�Ȃ�,�c�t���|�V���x��,�������悤������,�������c�t��,1.41E+12,2410005,�_�ސ쌧,���l�s����,�����Q�|�R�S�|�V,,045-951-0156,045-951-0183,2021/4/1,2021/4/1,2021/4/1,,,,,,,,,,,,,,,,,,,,,,,,,,,,,,,,,,,,,,,,,,,,,,,,,,,,,,,,,,,,,,,,,,,,,,,,,,,,,,,,,,,,,,,,,,,,,,,,,,,,,,,,,,,,,,,,,,,,,,,,,,,,,,,,,,,,,,,,,,,,,,,,,,,,,,,,,,,,,,,,,,,,,,,,,,,,,,,,,,,,,,,,,,,,,,,,,,,,,,,,,,,,18,0,8,9,,,,,,,2,0,8,3,,,,,,,,,,,,20,0,6,�c�t�����@�Ƌ�,,,,,,,,,,,,,,,,,7:30,18:30,,,,,,,,,,,,,,,27,3,,44,4,,45,4,,116,11,�R��,��l�ЂƂ肪��l���̍l���ŉ����̌��Ɋ��Y�����J�ȕۈ���s���Ă��܂��B,�q�ǂ��̂�肽�����⋻�����邱�Ƃ��؂ɂ��A����i��Ŏ��g�߂�悤�ۈ���s���Ă��܂��B�܂��A�L������𗘗p���ď�v�Ȑg�̍����s���Ă��܂��B,,"���j��,�Ηj��,���j��,�ؗj��,���j��",�Ȃ�,����,�Ȃ�,�����̌�t�i�X���܂��͐�����ł̔z�z���j,�\����,,,,,����,,,,,,,,,,,,,
�w�Z�@�l,���������ق�����@���݂�܂�������,�w�Z�@�l�@���R�w��,2460035,�_�ސ쌧,���l�s���J��,���J�Q���ڂQ�R�ԂR�S,,,,1.41E+12,,�c�t���|�V���x��,����Ƃ��悤������,�֓��c�t��,1.41E+12,2460035,�_�ސ쌧,���l�s���J��,�����J�Q���ڂQ�R�ԂR�S,,,,,,,,,,,,,,,,,,,,,,,,,,,,,,,,,,,,,,,,,,,,,,,,,,,,,,,,,,,,,,,,,,,,,,,,,,,,,,,,,,,,,,,,,,,,,,,,,,,,,,,,,,,,,,,,,,,,,,,,,,,,,,,,,,,,,,,,,,,,,,,,,,,,,,,,,,,,,,,,,,,,,,,,,,,,,,,,,,,,,,,,,,,,,,,,,,,,,,,,,,,,,,,,,,,,,,,,,,,,,,,,,,,,,,,,,,,,,,,,,,,,,,,,,,,,,,,,,,,,,,,,,,,,,,45,,,45,,,45,,,135,,,�R��,,,,,,,,,,,,,,,,,,,,,,,,,,,
�w�Z�@�l,���������ق�����@�悱�͂܂��ڂ���������,�w�Z�@�l�@���l�v�ۓc�w��,2410022,�_�ސ쌧,���l�s����,�߃P��P�|�P�V,,,,1.41E+12,,�c�t���|�V���x��,�邪�݂˂悤������,�߃����c�t��,1.41E+12,2410022,�_�ސ쌧,���l�s����,�߃P��P�|�P�V,,,,,,,,,,,,,,,,,,,,,,,,,,,,,,,,,,,,,,,,,,,,,,,,,,,,,,,,,,,,,,,,,,,,,,,,,,,,,,,,,,,,,,,,,,,,,,,,,,,,,,,,,,,,,,,,,,,,,,,,,,,,,,,,,,,,,,,,,,,,,,,,,,,,,,,,,,,,,,,,,,,,,,,,,,,,,,,,,,,,,,,,,,,,,,,,,,,,,,,,,,,,,,,,,,,,,,,,,,,,,,,,,,,,,,,,,,,,,,,,,,,,,,,,,,,,,,,,,,,,,,,,,,,,,,15,,,15,,,15,,,45,,,�R��,,,,,,,,,,,,,,,,,,,,,,,,,,,
�w�Z�@�l,���������ق�����@�ȂƂ肪������,�w�Z�@�l�@����w��,2360046,�_�ސ쌧,���l�s�����,�����J���R�|�P�|�R,,,,1.41E+12,,�c�t���|�V���x��,���Ȃ��悤������,�J�i�����c�t��,1.41E+12,2360046,�_�ސ쌧,���l�s�����,�����J���R�|�P�|�R,,,,,,,,,,,,,,,,,,,,,,,,,,,,,,,,,,,,,,,,,,,,,,,,,,,,,,,,,,,,,,,,,,,,,,,,,,,,,,,,,,,,,,,,,,,,,,,,,,,,,,,,,,,,,,,,,,,,,,,,,,,,,,,,,,,,,,,,,,,,,,,,,,,,,,,,,,,,,,,,,,,,,,,,,,,,,,,,,,,,,,,,,,,,,,,,,,,,,,,,,,,,,,,,,,,,,,,,,,,,,,,,,,,,,,,,,,,,,,,,,,,,,,,,,,,,,,,,,,,,,,,,,,,,,,76,,,81,,,83,,,240,,,�R��,,,,,,,,,,,,,,,,,,,,,,,,,,,
�w�Z�@�l,���������ق�����@�܂��܂�������,�w�Z�@�l�@�܂��܊w��,2350045,�_�ސ쌧,���l�s��q��,�m����S�|�P�Q,,,,1.41E+12,,�c�t���|�V���x��,������悤������,������c�t��,1.41E+12,2350045,�_�ސ쌧,���l�s��q��,�m����S�|�P�Q,,045-833-1929,,,,,,,,,,,,,,,,,,,,,,,,,,,,,,,,,,,,,,,,,,,,,,,,,,,,,,,,,,,,,,,,,,,,,,,,,,,,,,,,,,,,,,,,,,,,,,,,,,,,,,,,,,,,,,,,,,,,,,,,,,,,,,,,,,,,,,,,,,,,,,,,,,,,,,,,,,,,,,,,,,,,,,,,,,,,,,,,,,,,,,,,,,,,,,,,,,,,,,,,,,,,,,,,,,,,,,,,,,,,,,,,,,,,,,,,,,,,,,,,,,,,,,,,,,,,,,,,,,,,,,,,,,,,,,,,,,,,,,,,�R��,,,,,,,,,,,,,,,,,,,,,,,,,,,
�l,������������,����@�B��,2530063,�_�ސ쌧,������s,,,,,1.42E+12,�Ȃ�,�c�t���|�V���x��,�ӂ��΂悤������,�o�t�c�t��,1.41E+12,2300011,�_�ސ쌧,���l�s�ߌ���,�㖖�g�P���ڂP�W�|�W,,,,1954/6/30,1954/6/30,2020/3/31,,,,,,,,,,,,,,,,,,,,,,,,,,,,,,,,,,,,,,,,,,,,,,,,,,,,,,,,,,,,,,,,,,,,,,,,,,,,,,,,,,,,,,,,,,,,,,,,,,,,,,,,,,,,,,,,,,,,,,,,,,,,,,,,,,,,,,,,,,,,,,,,,,,,,,,,,,,,,,,,,,,,,,,,,,,,,,,,,,,,,,,,,,,,,,,,,,,,,,,,,,,,,,,,,,,,,,,,,,,11,1,,8,8,,,,,,11,1,12,"�ۈ�m���i,�c�t�����@�Ƌ�",,"���j��,�Ηj��,���j��,�ؗj��,���j��",9:00,14:00,,,,,,,,,,,,,,,,,,,0,,,0,,,0,,,35,,3,35,,2,35,,2,105,,7,�Q��,,,���H�E�ٓ����p,���j��,,����,�Ȃ�,�����̌�t�i�X���܂��͐�����ł̔z�z���j,���̑�,,����,�����ی��̓K�p,,����,�L�����܂ߒ��ډ��ɂ��₢���킹���������B,14000,,,,����,����,����,"���k�A����t�����̐ݒu,���k�A�����e�̋L�^",���̔������̕񍐋y�щ��P������m�O�ꂷ��̐��̐���,�閧�ێ��ɌW��K���̐���,�����{,
�w�Z�@�l,���������ق����񂢂�������������,�w�Z�@�l�爤�w��,2410001,�_�ސ쌧,���l�s����,�㔒�����W�X�T,,045-954-2301,,1.41E+12,,�c�t���|�V���x��,�����̂���悤������,�l�G�̐X�c�t��,1.41E+12,2410001,�_�ސ쌧,���l�s����,�㔒�����W�X�T,,,,1980/4/1,1980/4/1,2018/3/30,,,,,,,,,,,,,,,,,,,,,,,,,,,,,,,,,,,,,,,,,,,,,,,,,,,,,,,,,,,,,,,,,,,,,,,,,,,,,,,,,,,,,,,,,,,,,,,,,,,,,,,,,,,,,,,,,,,,,,,,,,,,,,,,,,,,,,,,,,,,,,,,,,,,,,,,,,,,,,,,,,,,,,,,,,,,,,,,,,,,,,,,,,,,,,,,,,,,,,,,,,,,,,,,,,,,,,,,,,,,,,,,,,,,,,,,,,"���j��,�Ηj��,���j��,�ؗj��,���j��",9:00,14:00,,,,,,,,,,,,,7:30,18:30,,,,,0,,,0,,,0,,,35,,,70,,,70,,,175,,,�Q��,,,,,,,,,���O�A��{���j���Ɋ�Â��I�l,,,,,����,,,����,,,����,����,����,,,,,
�w�Z�@�l,���������ق����񂠂����킪������,�w�Z�@�l���V�w��,2440813,�k�C��,���l�s�˒ˋ�,�������R�T�T�V�]�S,,045-822-3400,,1.41E+12,�Ȃ�,�c�t���|�V���x��,�܂������悤������,�����c�t��,1.41E+12,2440813,�_�ސ쌧,���l�s�˒ˋ�,�������R�T�T�V�|�S,,045-822-3400,,1970/4/10,1970/4/1,2017/3/31,,,,,,,,,,,,,,,,,,,,,,,,,,,,,,,,,,,,,,,,,,,,,,,,,,,,,,,,,,,,,,,,,,,,,,,,,,,,,,,,,,,,,,,,,,,,,,,,,,,,,,,,,,,,,,,,,,,,,,,,,,,,,,,,,,,,,,,,,,,,,,,,,,,,,,,,,,,,,,,,,,,,,,,,,,,,,,,,,,,,,,,,,,,,,,,,,,,,,,,,,,,,,,,,,,,,,,,,,,,,,,,,,,,,,,,,,,"���j��,�Ηj��,���j��,�ؗj��,���j��",8:30,14:00,,,,,,,,,,,,,7:30,18:30,7:30,15:30,,,0,,,0,,,0,,,60,,,90,,,90,,,240,,,�R��,,,,"���j��,���j��",����,����,�Ȃ�,,�\����,,,,,����,�L�����܂ߒ��ډ��ɂ��₢���킹���������B,,����,,,����,����,����,���k�A����t�����̐ݒu,"���̔������̑Ή��y�ю��̔����h�~�̂��߂̎w�j�̐���,���̔������̕񍐋y�щ��P������m�O�ꂷ��̐��̐���,���̔����h�~�̂��߂̒���I�Ȍ��C�̎��{",�閧�ێ��ɌW��K���̐���,�����{,
�l,�ӂ邨��@�Ƃ�,�Ô��J�@��,2230061,�_�ސ쌧,���l�s�`�k��,,,045-563-2661,,1.41E+12,�Ȃ�,�c�t���|�V���x��,�����悤������,�`�����c�t��,1.41E+12,2230061,�_�ސ쌧,���l�s�`�k��,���g�R�|�P�O�|�Q�R,,045-563-2661,,1975/12/15,1976/4/1,2015/4/1,,,,,,,,,,,,,,,,,,,,,,,,,,,,,,,,,,,,,,,,,,,,,,,,,,,,,,,,,,,,,,,,,,,,,,,,,,,,,,,,,,,,,,,,,,,,,,,,,,,,,,,,,,,,,,,,,,,,,,,,,,,,,,,,,,,,,,,,,,,,,,,,,,,,,,,,,,,,,,,,,,,,,,,,,,,,,,,,,,,,,,,,,,,,,,,,,,,,,,,16,5,,,,,,,,,,,,,,,,,,,,,,,,,,,,,16,5,14,�c�t�����@�Ƌ�,,"���j��,�Ηj��,���j��,�ؗj��,���j��",0:00,0:00,,,,,,,,,,,,,7:30,18:30,,,,,0,,,0,,,0,,,0,105,4,0,120,4,0,107,3,0,332,11,�R��,,,�ٓ��̂ݎ��{,,����,����,�Ȃ�,�����̌�t�i�X���܂��͐�����ł̔z�z���j,���̑�,,�S���E�����Ή�,�{�ݔ����ی��ɉ���,,����,�L�����܂ߒ��ډ��ɂ��₢���킹���������B�����E��g�[��A���ޓ�,,����,�S�C�O�O�O�~�i������e����w�̏[����}��ׁj,,����,����,����,���k�A����t�����̐ݒu,���̔������̑Ή��y�ю��̔����h�~�̂��߂̎w�j�̐���,�閧�ێ��ɌW�錤�C�̎��{,�����{,
�w�Z�@�l,���������ق����񂽂��͂���������,�w�Z�@�l�����w��,2270044,�_�ސ쌧,���l�s�t��,��������P�T�]�S,,045-973-5738,,1.41E+12,�Ȃ�,�c�t���|�V���x��,���������悤������,�s�����c�t��,1.41E+12,2250024,�_�ސ쌧,���l�s�t��,�s�P�����Q�P�W�Q,,045-971-6216,,1965/4/1,1965/4/1,2018/4/1,�~�A�w���T�ۈ牀�Ђт��s����,,�~�A�w���T�ۈ牀�Ђт��]�c,,��Ƃ�E�s�b�s,,,,,,,,,,,,,,,,,,,,,,,,,,,,,,,,,,,,,,,,,,,,,,,,,,,,,,,,,,,,,,,,,,,,,,,,,,,,,,,,,,,,,,,,,,,,,,,,,,,,,,,,,,,,,,,,,,,,,,,,,,,,,,,,,,,,,,,,,,,,,,,,,,,,,,,,,,,,,,,,,,,,,,,,,,,,,,,,,,,,,,,,,,,,,,,,,,,,,,,,,,,,,,,,,,,,,,16,8,8,4.4,8.3,,,,,,16,8,8,"�ۈ�m���i,�c�t�����@�Ƌ�",,"���j��,�Ηj��,���j��,�ؗj��,���j��",8:30,14:30,,,,,,,,,,,,,7:30,19:00,,,,,0,,,0,,,0,,,70,54,3,70,68,2,70,71,2,210,193,7,�R��,��{���O�F�`�S�Ƒ̂̒��a�I���B�`�^�l�i�𑸂сA�l�⏬������������S����^���R�𑸂сA��n�⑐�Ԃ�������S����^���{�����𑸂сA���ێЉ��������S����ۈ�ڕW�F���R���������Ă̗V�т̏[���ƁA��Ăł̊����̂��[����}��B�l�ԋ���͊���A�����I�ȕ����␔���ɂ��āA����̕ۈ犈���̂Ȃ��ŋ�����K���ւ̈ӎ������}��B�𓖉��̕ۈ�ڕW�Ƃ��A��N��ʂ��ėl�X�ȗV�т��Ċ������s���Ă��܂��B�܂��A�w�N���ƂɁA���̔N��̎q�ǂ������̐����ɍ��킹�����e��������A��ЂƂ̊����̂Ȃ��肪�q�ǂ������̐����Ɍ��т��Ă����܂��B�������ۈ�҂́u�q�ǂ��̋C�����������u�ԁv���؂ɂ��Ă��܂��B�ڂ����͓����̃z�[���y�[�W�Fhttps://www.ichigao.ed.jp,�c�t������v�̂Ɏ����ꂽ5�̈�i���N�A�l�Ԋ֌W�A���A���t�A�\���j���̂˂炢���B�������悤�ɑ����I�Ɏw�����܂��B�c�����̎q�ǂ������́A�c�t���ł̏W�c�����⎩���I�ȗV�т�ʂ��āA�S�Ɛg�̂𑶕��ɓ������Ȃ���u������́v�̊�b���������g�ɂ��A�����ւ̉\�����L���Ă����܂��B�������s�����c�t���́A���̐�����͂����ł������߂Ɂu�V�сv����̂Ƃ����ۈ���j�Ƃ��āA��l�ЂƂ�̎q�ǂ������ƌ��������A���ꂼ��̐S�Ɛg�̂̐����Ɋ��Y���Ȃ���ۈ�ɂ������Ă��܂��B�����āA��������ʂ��ĐS�g�̃o�����X�Ƃꂽ������ڕW�Ƃ��A�ی�҂̊F�l�ƂƂ��ɓ��X�q�ǂ�������������Ă����܂��B�c�t�����q�ǂ������ɂƂ��ĐS���킭�킭����ꏊ�A�搶�����������݂ł��葱�������ƍl���Ă��܂��B�ڂ����͓����̃z�[���y�[�W�Fhttp://ichigao.ed.jp,�ٓ��̂ݎ��{,,����,����,�Ȃ�,�����̌�t�i�X���܂��͐�����ł̔z�z���j,���O�A��{���j���Ɋ�Â��I�l,,�������ӔC�ҁF���������������S���F�������A�w�N��C��������O�҈ψ��F������y�ѕ]�c����,"�����C������΍Еی�������Ё@�c�̑��������ی��i�ΐl����1���~�^1���A4���~�^1���́A�Ε�����1,000���~�j���������j�b�Z�C���a���ہ@�����ӔC�ی��i�ΐl����3,000���~�^1���A3���~�^1���́A�Ε�����100���~�j",�y��ȍs���z4���F�������@5���F�����E�������E�݁@6���F���Ⴊ�����@��E��؂̎�E�c�A���@7���F�[���݉�E�����ъԊw�Z�@8���F���������߂�@9�`11���F�^����E�H�̎��n�����E���������܂�@12���F�N���X�}�X���y��i���\��j�@1���F�������V�т��y���މ�@2���F���ЂȂ܂��i���\��j�@3���F���������E�������@�Ȃǁy���ٓ��z���A�΁A�؁A���j����1���ۈ���͂��ٓ����Q�����ٓ������Ȃ��ꍇ�́A���ٓ��𒍕����邱�Ƃ��ł��܂��i1�H350�~�Œ񋟁j�����T�Ηj���Ƌ��j���͋������p�̓��ł��B�y�ۈ�̓��F�z�q�ǂ��̐����i�����сj�𒆐S�Ɏ��含�A�����S�A�n������|���A�����ɋK�͈ӎ�����āA�����O���킸�Љ�ɍv���ł���u������́v�̈琬��ڕW�ɕۈ�����H���Ă��܂��B�܂��A���l�s�t����ōł������̎��R���c��ǍD�ȗ��n���ŁA�N�Ԃ�ʂ��Ĕ��⎩�R�ɐG���@�����������܂��B����ɁA�{�݌^���t���Ƃ��āA���l�s�^�a����ۈ��2�ΐe�q�N���X�̎��{�ȂǁA�l�X�Ȋ��ɂ���q��ĉƒ���x�����Ă���c�t���ł��B�ڂ����͓����̃z�[���y�[�W�Fhttps://www.ichigao.ed.jp,����,"�y�S�����璥��������́z�ۈ狳�ޔ�6,000�~�^���N�@�G�{��4,800�`5,400�~���x�^���N�A������4,700�~���x�i�N���j�E800�~���x�i�N���j�E18,000�~���x�i�N���^�ъԊw�Z�܂ށj�y��]�҂��璥��������́z�X�N�[���o�X�^�s�o��48,000�~�^���N�i��]�ҁj�@�����y�їp�i�ꎮ30,000�~���x�i�������ɍw���j�A����88�~�^1�{�@�����ٓ�350�~�^��H�@�X�i�b�v�ʐ^��100�~�i���j500�~�i��j�@IC�J�[�h1,000�~�^�ǉ�1�� �����ϗ���10,300�~���x��39,700�~�͏�����l���L�ڂ��Ă��܂��B",39700,����,"�����������90,000�~�^�N�����������i�N��������40,000�~�j�{�݈ێ��C�U��30,000�~�^���N���ޔ�3,600�~�^���N�i���������L���p������́j��g�[��6,000�~�^���N",129600,����,����,����,"���k�A����t�����̐ݒu,���k�A�����e�̋L�^,���k�A���Ɋւ���s�������{���Ƃւ̋���,���P���ʂ̎s�����ւ̕�","���̔������̑Ή��y�ю��̔����h�~�̂��߂̎w�j�̐���,���̔������̕񍐋y�щ��P������m�O�ꂷ��̐��̐���,���̔����h�~�̂��߂̒���I�Ȍ��C�̎��{","�閧�ێ��ɌW��K���̐���,�閧�ێ��ɌW�錤�C�̎��{",�����{,