�@�l���̎��,�@�l���̖���(�ӂ肪��),�@�l���̖���,�@�l���̎傽�鎖�����̏��ݒn_�X�֔ԍ�,�@�l���̎傽�鎖�����̏��ݒn_�s���{��,�@�l���̎傽�鎖�����̏��ݒn_�s�撬��,�@�l���̎傽�鎖�����̏��ݒn_�����E�Ԓn,�@�l���̎傽�鎖�����̏��ݒn_�������E�����ԍ���,�@�l���̘A����_�d�b�ԍ�,�@�l���̘A����_���̑��A����,���ƎҔԍ�,���ƎҔԍ�,�@�l������E�ۈ��񋟂��A���͒񋟂��悤�Ƃ���{�ݓ��̏��ݒn���Ǌ�����s���{���̋����ɏ��݂��铖�Y�@�l���ݒu���鋳��E�ۈ�{�݋y�ѓ��Y�@�l���s���n��^�ۈ玖��,�{�ݗތ^,�{�݂̖���(�ӂ肪��),�{�݂̖���,���Ə��ԍ�,�X�֔ԍ�,�{�݂̏��ݒn �s���{��,�{�݂̏��ݒn �s�撬��,�{�݂̏��ݒn �����E�Ԓn,�{�݂̏��ݒn �������E�����ԍ���,�{�݂̘A���� �d�b�ԍ�,�{�݂̘A���� ���̑��A����,���Ƃ̔F�N����,���Ƃ̊J�n�N����,���Ƃ̊m�F�N����,�A�g�{��(01)_�A�g��{�ݖ�,�A�g�{��(01)_�A�g���e,�A�g�{��(02)_�A�g��{�ݖ�,�A�g�{��(02)_�A�g���e,�A�g�{��(03)_�A�g��{�ݖ�,�A�g�{��(03)_�A�g���e,�A�g�{��(04)_�A�g��{�ݖ�,�A�g�{��(04)_�A�g���e,�A�g�{��(05)_�A�g��{�ݖ�,�A�g�{��(05)_�A�g���e,�A�g�{��(06)_�A�g��{�ݖ�,�A�g�{��(06)_�A�g���e,�A�g�{��(07)_�A�g��{�ݖ�,�A�g�{��(07)_�A�g���e,�A�g�{��(08)_�A�g��{�ݖ�,�A�g�{��(08)_�A�g���e,�A�g�{��(09)_�A�g��{�ݖ�,�A�g�{��(09)_�A�g���e,�ۈ狳�@_�]�ƎҐ�_���,�ۈ狳�@_�]�ƎҐ�_����,�ۈ狳�@_�J������,�ۈ狳�@_���όo���N��_���,�ۈ狳�@_���όo���N��_����,���@���͕ۈ�m_�]�ƎҐ�_���,���@���͕ۈ�m_�]�ƎҐ�_����,���@���͕ۈ�m_�J������,���@���͕ۈ�m_���όo���N��_���,���@���͕ۈ�m_���όo���N��_����,�ۈ�m_�]�ƎҐ�_���,�ۈ�m_�]�ƎҐ�_����,�ۈ�m_�J������,�ۈ�m_���όo���N��_���,�ۈ�m_���όo���N��_����,�ۈ�]����_�]�ƎҐ�_���,�ۈ�]����_�]�ƎҐ�_����,�ۈ�]����_�J������,�ۈ�]����_���όo���N��_���,�ۈ�]����_���όo���N��_����,���@_�]�ƎҐ�_���,���@_�]�ƎҐ�_����,���@_�J������,���@_���όo���N��_���,���@_���όo���N��_����,�ƒ�I�ۈ�� ���͉ƒ�I�ۈ�⏕��_�]�ƎҐ�_���,�ƒ�I�ۈ�� ���͉ƒ�I�ۈ�⏕��_�]�ƎҐ�_����,�ƒ�I�ۈ�� ���͉ƒ�I�ۈ�⏕��_�J������,�ƒ�I�ۈ�� ���͉ƒ�I�ۈ�⏕��_���όo���N��_���,�ƒ�I�ۈ�� ���͉ƒ�I�ۈ�⏕��_���όo���N��_����,���v_�]�ƎҐ�_���,���v_�]�ƎҐ�_����,�E����l������̎q�ǂ��̐�,�L����Ƌ��E���i,�L����Ƌ��E���i_���̑�,�J����,�J��������_�����J��,�J��������_������,�J��������_�y�j���J��,�J��������_�y�j����,�J��������_���j���J��,�J��������_���j����,�a����ۈ玞��_�����J��,�a����ۈ玞��_������,�a����ۈ玞��_�y�j���J��,�a����ۈ玞��_�y�j����,�a����ۈ玞��_���j���J��,�a����ۈ玞��_���j����,0��_���p�����,0��_���p�Ґ�,0��_�w����,1��_���p�����,1��_���p�Ґ�,1��_�w����,2��_���p�����,2��_���p�Ґ�,2��_�w����,3��_���p�����,3��_���p�Ґ�,3��_�w����,4��_���p�����,4��_���p�Ґ�,4��_�w����,5��_���p�����,5��_���p�Ґ�,5��_�w����,���v_���p�����,���v_���p�Ґ�,���v_�w����,�^�c���@,����E�ۈ�̓��e��,���H�̎��{��_���{��,���H�̎��{��_�񋟓�,��Q���̎󂯓���̐�,�ꎞ�a���莖�Ƃ̎��{,�a���ۈ玖�Ƃ̎��{,���p�葱��,�I�l�,���̑��̗��p,���ɑ΂��鑋����,�������ׂ����̂ւ̑Ή�,�񋟓��e�̓��F,���p��_�����_������̗L��,���p��_�����_���R,���p��_�����_���z,���p��_��悹����_��悹�����̗L��,���p��_��悹����_���R,���p��_��悹����_���z,�񋟊J�n���̐���,���p�҂̓���,���p�ҕ��S�̗��p���Ɋւ������,���k�A���̑Ή��̂��߂̎�g,���̔����̖h�~�y�є������̑Ή�,�l��񓙂̎�g��,��O�ҕ]�����̎��{�E���ʂ̌��\��,��O�ҕ]�����̌���
�c���@�l�i������Г��j,���Ԃ�����������܂݁[���񂽁[�Ȃ���Ȃ�,������Ё@�}�~�[�E�C���^�[�i�V���i��,2310062,�_�ސ쌧,���l�s����,���ؒ��P�|�P,�O�����r���[�r���T�e,045-680-5577,,1420708000012 ,,�Ȃ�,���K�͕ۈ玖�Ǝҁ|A�^,�܂݁[�ق�������ӂ��܂�����,�}�~�[�ۈ牀�񖓐�,1410052004710 ,2410822,�_�ސ쌧,���l�s����,�������u�R,�s�o�n�C�c�P�K,045-366-5718,,2017/3/31,2017/4/1,2017/4/1,,,,,,,,,,,,,,,,,,,,,,,,,,,,,7,6,8,,,,,,,,,,,,,,,,,,7,6,,"�ۈ�m���i,�c�t�����@�Ƌ�",,2017/4/1,7:00,20:00,7:00,20:00,,,,,,,,,6,,1,6,,1,7,,1,0,,,0,,,0,,,19,,3,�y�ۈ���j�z�Z�u�ɂ�����v���O�����v�ɉ������y�����ۈ��ʂ��āA�g�m�肽���E�w�т����h�Ƃ������ǂ��̋C�����������o���܂��Z���������₩�ŉƒ�I�ȕ��͋C�̒��ŁA���ǂ��̋C�����Ɋ��Y�����ۈ���s�����ƂŁA��̈�����͂���܂��Z�y�����H���̎��Ԃ�ʂ��āA�H�ւ̊֐S�������o���A�u�H�v�̑�؂���`���܂��Z���ǂ�����̓I�ɍs���ł���A���S�Ȋ��𐮂��A�����܂���������͂���Ă܂��Z�ƒ�ƘA�g���A�A�����̂���ۈ��ʂ��Ă��ǂ��̌��₩�Ȑ�������݂܂��y�ۈ�ڕW�z�Z���낢��Ȃ��Ƃɋ����֐S�̂��Ă邱�ǂ��Z�������F��������؂ɂ��邱�ǂ��Z�y�����H�ׂ錳�C�Ȃ��ǂ��Z�����ōl���邱�ǂ�,�����̗��p�Ґ��́A���l�sHP�ɂČ��\���Ă��܂��B,���H�̂ݎ��{,"���j��,�Ηj��,���j��,�ؗj��,���j��,�y�j��",����,�Ȃ�,�Ȃ�,,,,���c���́A�l�ԂƂ��Ĉ�ł���؂Ȏ����ł��B���̐l�i�`���̑�؂Ȏ������ƒ�ƕۈ�҂��M���֌W���m�����āA�Ƃ��Ɉ玙�ɐi�߂Ă������Ƃ���؂ł��B�ۈ牀�ł́A�ی�҂���̂��ӌ��E�����k�E���v�]�𐏎��󂯕t���Ă���܂��B�y���ɑ΂��鑋���z����t�S���ҁF�������@����t�ӔC�ҁF������O�҈ψ�,���{�X�|�[�c�U���Z���^�[�ЊQ���t���x,�y��ȍs���z4���F�������j����@5���F�e�q�����@7���F���[�܂�@8���F�čՂ�@10���F�^����@12���F�N���X�}�X����\��@2���F���܂��@3���F�ЂȍՂ�E�������y���F�z�u�ɂ�����v���O�����v�ɉ������y�����ۈ��ʂ��āA�g�m�肽���E�w�т����h�Ƃ������ǂ��̋C�����������o���܂��Z�p��v���O�����gEnjoy English�h�Z�H��v���O�����Z�^���v���O�����g�������������v���O�����h�Z���y�v���O�����Z���`�v���O�����Z���͂Ȃ���,����,�L�����܂ߒ��ډ��ɂ��₢���킹���������B,,�Ȃ�,,,����,����,����,"���k�A����t�����̐ݒu,���k�A�����e�̋L�^,���k�A���Ɋւ���s�������{���Ƃւ̋���,���P���ʂ̎s�����ւ̕�","���̔������̑Ή��y�ю��̔����h�~�̂��߂̎w�j�̐���,���̔������̕񍐋y�щ��P������m�O�ꂷ��̐��̐���,���̔����h�~�̂��߂̒���I�Ȍ��C�̎��{","�閧�ێ��ɌW��K���̐���,�閧�ێ��ɌW�錤�C�̎��{",,
�c���@�l�i������Г��j,���Ă炦�łク������񂪁[�ł�,Stellar education garden,1340084,�����s,�]�ː��,�������T�|�R�V�|�P�U,,,,1312308100047 ,,,���K�͕ۈ玖�Ǝҁ|A�^,���Ă炦�łク������񂪁[�ł񂠂��킵�傤���ڂق�������,stellar education garden���v�a���K�͕ۈ牀,1410052005485 ,2460025,�_�ސ쌧,���l�s���J��,���v�a���Q�|�U�O�|�P�@,�A�N�������g�V�e�B�P�O�Q,,,2020/11/1,,,,,,,,,,,,,,,,,,,,,,,,,,,,,,,,,,,,,,,,,,,,,,,,,,,,,,,,,,,,,,,,,,,,,0,,,5,,,5,,,,,,,,,,,,10,,,,,,,,,,,,,,,,,,,,,,,,,,,,,
�c���@�l�i������Г��j,���傤�����������ǂ���������,�V���E��捇�����,2210014,�_�ސ쌧,���l�s�_�ސ��,���]�Q���ڂX�ԂP�W��,,045-594-8622,045-594-8622,1410008001182 ,,����,���K�͕ۈ玖�Ǝҁ|B�^,�Ђ������Ȃ���Ђ���ق�������,���_�ސ�Ђ���ۈ牀,1410052003464 ,2210824,�_�ސ쌧,���l�s�_�ސ��,�L�䑾�c���S�|�Q,,045-594-8622,,2015/4/1,2015/4/1,2015/4/1,,,,,,,,,,,,,,,,,,,,,,,,,,,,,3,2,,,,,,,,,,1,,,,,,,,,3,3,3,"�ۈ�m���i,�c�t�����@�Ƌ�",,2015/4/1,7:30,19:00,7:30,16:30,,,,,,,,,3,,,7,,,8,,,0,,,0,,,0,,,18,,,,�����̗��p�Ґ��́A���l�sHP�ɂČ��\���Ă��܂��B,���H�̂ݎ��{,"���j��,�Ηj��,���j��,�ؗj��,���j��,�y�j��",����,�Ȃ�,�Ȃ�,,,,����t�@�����������@��\,�����ی��@���������j�b�Z�C���a����,,����,�L�����܂ߒ��ډ��ɂ��₢���킹���������B,,�Ȃ�,,,����,����,����,"���k�A����t�����̐ݒu,���k�A�����e�̋L�^","���̔������̑Ή��y�ю��̔����h�~�̂��߂̎w�j�̐���,���̔������̕񍐋y�щ��P������m�O�ꂷ��̐��̐���,���̔����h�~�̂��߂̒���I�Ȍ��C�̎��{","�閧�ێ��ɌW��K���̐���,�閧�ێ��ɌW�錤�C�̎��{",�����{,
�c���@�l�i������Г��j,���Ԃ�����������Ђ܂��,������Ђg�h�l�`�v�`�q�h,2450013,�_�ސ쌧,���l�s���,���c���S�|�T�P�|�U,,045-804-4428,045-515-7768,1410008001455 ,,����,���K�͕ۈ玖�Ǝҁ|A�^,�Ȃ����Ђ܂��ق�������,���c�Ђ܂��ۈ玺,1410052004611 ,2450013,�_�ސ쌧,���l�s���,���c���S�|�T�P�|�V,,045-515-7768,,2017/3/31,2017/4/1,2017/4/1,,,,,,,,,,,,,,,,,,,,,,,,,,,,,6,3,8,8,4,,,,,,,,,,,,,,,,6,3,3,�ۈ�m���i,,2017/4/1,7:30,19:00,8:00,19:00,,,,,,,,,3,,1,8,,1,8,,1,0,,,0,,,0,,,19,,3,�O�Ύ�����Q�Ύ��̂��q�l��ΏۂƂ�������P�X���̏��K�͕ۈ玺�ł��B�ƒ�I�ۈ玺����A�Q�O�P�V�N�S���ɔF�ۈ牀�Ƃ��ĐV���ɊJ�������ۈ玺�͖؂̉�������������鉀�ɂɍL�X�Ƃ����낪���鏬�K�͕ۈ玺�ł͒�������Ƃ�̂��鑢��Ŏq���B�͂̂т̂тƉ߂����Ă��܂��B���̍؉��ł͕c�A��������n�܂ł̐H�犈���ɂ��͂����Ă���܂��B�~�n���ɂ̓~�j�T�[�L�b�g������A���C�����ς��̎q�������̏΂������₦�Ȃ����邢�ۈ玺�ł��B,�����̗��p�Ґ��́A���l�sHP�ɂČ��\���Ă��܂��B,���H�̂ݎ��{,"���j��,�Ηj��,���j��,�ؗj��,���j��,�y�j��",����,�Ȃ�,�Ȃ�,,,,�ی�җl�̂��ӌ����v�]�́A�܂��A����������ŒS�C�ۈ�m��ʂ��ĉ����֕񍐂��ꔻ�f�����B���ł̉���������Č��ɂ��Ă͑�O�҈ψ��i���ւɎ����A����f��2���j�֕񍐂�������}��B�Ⴕ���͒��ڕی�җl�����O�҈ψ��i���ւɎ����A����f���j�֘A�������Ē�����O�҈ψ����牀���֕�����蒲�������Ė�������}��B,���ۃW���p�������ӔC�ی������@�@�@�@,,����,�A������@�N3�`4���@�@1��130�~,520,�Ȃ�,,,����,����,����,"���k�A����t�����̐ݒu,���k�A�����e�̋L�^,���k�A���Ɋւ���s�������{���Ƃւ̋���,���P���ʂ̎s�����ւ̕�","���̔������̑Ή��y�ю��̔����h�~�̂��߂̎w�j�̐���,���̔������̕񍐋y�щ��P������m�O�ꂷ��̐��̐���",�閧�ێ��ɌW��K���̐���,�����{,
�c���@�l�i������Г��j,�炢�ӂ��,������Ѓ��C�t���,2450012,�_�ސ쌧,���l�s���,���c�k�꒚�ڂW�ԂT��,�R�X��Aoi���c,045-392-6355,045-443-8253,1410008001307 ,,����,���K�͕ۈ玖�Ǝҁ|A�^,�Ђ����Ƃ���т��Ƃق�������,���˒˂�т��ƕۈ牀,1410052005329 ,2440801,�_�ސ쌧,���l�s�˒ˋ�,�i�Z���T�Q�P�|�Q,�P�K,045-443-9270,045-392-6355,2020/3/31,2020/4/1,2020/3/31,�����������ۈ牀,,�Z�c�쐼�ۈ牀,"������ɂ�錒�N�f�f���Ɋւ���x��,���O�V�Z��̗��p�Ɋւ���x��,�����ۈ�Ɋւ���x��,�s���ւ̎Q���Ɋւ���x��,������̎󂯎M�Ƃ��Ă̎x��",,,,,,,,,,,,,,,0,0,,,,0,0,,,,5,5,8,12.9,7.6,0,0,,,,0,0,,,,0,0,,,,5,5,2,"�ۈ�m���i,�c�t�����@�Ƌ�,���̑�",�h�{�m�E�����t,2020/4/1,7:00,19:00,7:00,19:00,,,,,,,,,3,,,8,,,8,,,0,,,0,,,0,,,19,,,�ۈ痝�O�F�E���̘J�����̉��P�ɓw�߂邱�Ƃɂ��A�q�ǂ���l������̕ۈ玞�Ԃ𑝂₵�A�����ɕۈ�̎������߁A�܂��q�ǂ������ɂ͐S�ɂ�Ƃ�����Ă��l�ɂȂ�ׂ̑b���`���ł������n��̕��Ƌ��ɗ^���Ă����B,�����̗��p�Ґ��i�ۈ痘�p�j�́A���l�sHP�ɂČ��\���Ă��܂��B����E�ۈ�̓��e���ɂ��ďڂ����́A�����̃z�[���y�[�Whttp://www.hrabbit.jp/,���H�̂ݎ��{,"���j��,�Ηj��,���j��,�ؗj��,���j��,�y�j��",����,�Ȃ�,�Ȃ�,,,���l�s�̗��p�����ɂ���Č���B,�������ӔC�ҁF�^�c�ӔC�ҋ������S���ҁF�Ǘ��ӔC��,,,����,�L�����܂ߒ��ډ��ɂ��₢���킹���������B,,�Ȃ�,,,����,����,����,"���k�A����t�����̐ݒu,���k�A�����e�̋L�^","���̔������̑Ή��y�ю��̔����h�~�̂��߂̎w�j�̐���,���̔������̕񍐋y�щ��P������m�O�ꂷ��̐��̐���,���̔����h�~�̂��߂̒���I�Ȍ��C�̎��{","�閧�ێ��ɌW��K���̐���,�閧�ێ��ɌW�錤�C�̎��{",�����{,
�c���@�l�i������Г��j,�����ρ[�Ƃȁ[���Ԃ�����������,�P�A�p�[�g�i�[�������,1080075,�����s,�i���,����U�|�Q�O�|�P�S�@,�C�[�X�g�X�N�G�A��X�T�K,03-6404-8111,045-322-5650,1310308000100 ,,����,���K�͕ۈ玖�Ǝҁ|A�^,�������ρ[�Ƃȁ[�Ђ悵,�L�b�Y�p�[�g�i�[���g,1410052003233 ,2230051,�_�ސ쌧,���l�s�`�k��,���֒��P�|�P�|�P�W,,045-560-2300,,2015/4/1,2015/4/1,2015/4/1,�x�l�b�Z�@���g�ۈ牀,,�Љ���@�l�t������݂̂�̂��ݕۈ牀,,�`�����c�t��,,�u���C�g�ۈ牀���l���g,,,,,,,,,,,,,,,,,,,,,,7,,8,,,,,,,,,,,,,,,,,,7,,,"�ۈ�m���i,�c�t�����@�Ƌ�",,2015/4/1,7:00,19:00,7:00,19:00,,,,,,,,,3,,,8,,,8,,,0,,,0,,,0,,,19,,,http://www.care-partner.com/,�����̗��p�Ґ��́A���l�sHP�ɂČ��\���Ă��܂��B,���H�̂ݎ��{,"���j��,�Ηj��,���j��,�ؗj��,���j��,�y�j��",����,�Ȃ�,�Ȃ�,,,,����t�ӔC�ҁF��C�E�{�ВS���ҋ������ӔC�ҁF�����E�{�ВS���ґ�O�҈ψ���F�ٌ�m�E�s�����m�E���X�N�R���T���^���g���f�B�G�[�^�[,,�ƒ�I�Ȋ��̒��ŌX�̗v���𖞂�����̈��肪�}���ۈ��ڎw���Ă��܂��B�N��ʕۈ����{�Ƃ��ٔN��ۈ��������Ă��܂��B,�Ȃ�,,,�Ȃ�,,,����,����,����,"���k�A����t�����̐ݒu,���k�A�����e�̋L�^,���k�A���Ɋւ���s�������{���Ƃւ̋���,���P���ʂ̎s�����ւ̕�","���̔������̑Ή��y�ю��̔����h�~�̂��߂̎w�j�̐���,���̔������̕񍐋y�щ��P������m�O�ꂷ��̐��̐���,���̔����h�~�̂��߂̒���I�Ȍ��C�̎��{","�閧�ێ��ɌW��K���̐���,�閧�ێ��ɌW�錤�C�̎��{",�����{,
�c���@�l�i������Г��j,�����ρ[�Ƃȁ[���Ԃ�����������,�P�A�p�[�g�i�[�������,1080075,�����s,�i���,����U�|�Q�O�|�P�S�@,�C�[�X�g�X�N�G�A��X�T�K,03-6404-8111,045-322-5650,1310308000100 ,,����,���K�͕ۈ玖�Ǝҁ|A�^,�������ρ[�Ƃȁ[�悱�͂܂����̂����傤,�L�b�Y�p�[�g�i�[���l�풬,1410052004157 ,2200003,�_�ސ쌧,���l�s����,�풬�T�|�T,,045-328-3701,,2016/3/31,2016/4/1,2016/3/31,�A�C��������ۈ牀,������̎󂯎M�Ƃ��Ă̎x��,�ނ݈�����,,���[�~���ۈ牀,,,,,,,,,,,,,,,,,,,,,,,,6,2,8,4,4,,,,,,,,,,,,,,,,6,2,3,"�ۈ�m���i,�c�t�����@�Ƌ�",,2016/4/1,7:00,19:00,7:00,19:00,,,,,,,,,3,,,8,,,8,,,0,,,0,,,0,,,19,,,�y�ۈ痝�O�z�������́A�q�ǂ������A�����Ă�����邷�ׂĂ̂��������́u���C�v��n�����A�Љ�ɍv�����Ă܂���܂��B�E��̈��肪�}���A���S�ň��S���ĉ߂�����ŗǂ̊���񋟂��܂��B�E��R�̗V�т�̌���ʂ��A�D��S��n�����A�\���͂���Ă܂��B�E��������̐l�Ƃ̂ӂꂠ������A���邭���C�ɂ������ł���q�ǂ�����Ă܂��B�E�����ł�肽���A�Ƃ����C�������؂ɂ��Ď����S����Ă܂��B�E��������̂₳�����𒍂��A�v�����̂���A�₳�����L���ȐS����݂܂��B�E�����ۈ�@����,�����̗��p�Ґ��́A���l�sHP�ɂČ��\���Ă��܂��B,���H�̂ݎ��{,"���j��,�Ηj��,���j��,�ؗj��,���j��,�y�j��",����,�Ȃ�,�Ȃ�,,,,����,����,�S�g�̃o�����X���Ƃꂽ�����̂��߁u���v�Ɓu�Áv�̃v���O��������������Ƃ��Ă܂��B��������̐l�Ƃ̂ӂꂠ����@������܂��B,�Ȃ�,,,�Ȃ�,,,����,����,����,"���k�A����t�����̐ݒu,���k�A�����e�̋L�^,���k�A���Ɋւ���s�������{���Ƃւ̋���,���P���ʂ̎s�����ւ̕�","���̔������̑Ή��y�ю��̔����h�~�̂��߂̎w�j�̐���,���̔������̕񍐋y�щ��P������m�O�ꂷ��̐��̐���,���̔����h�~�̂��߂̒���I�Ȍ��C�̎��{","�閧�ێ��ɌW��K���̐���,�閧�ێ��ɌW�錤�C�̎��{",�����{,
NPO �@�l,���������ہ[�Ƃ܂��,�i����j�n��T�|�[�g�}����,2360038,�_�ސ쌧,���l�s�����,�Z�Y��T�|�P�|�P�Q,,045-786-0873,,1410004001012 ,,����,���K�͕ۈ玖�Ǝҁ|A�^,���Ă��Ă��ق������܂��,�ƒ�I�ۈ玺�@�}����,1410052002821 ,2360031,�_�ސ쌧,���l�s�����,�Z�Y�S�|�P�X�|�P�X,�Ԑ��r���P�K,045-785-3381,045-786-0873,2015/4/1,2012/10/1,2015/4/1,,,,,,,,,,,,,,,,,,,,,,,,,,,,,6,3,7.5,17.8,16.3,,,,,,,,,,,,,,,,6,3,3,"�ۈ�m���i,�c�t�����@�Ƌ�",,2012/10/1,7:30,19:00,7:30,18:30,,,,,,,,,0,,,5,,,5,,,0,,,0,,,0,,,10,,,�q�ǂ������̈��S�ƈ��S��ۈ�̊�{�Ƃ��Ă��܂��B�E���K�͂ŉƒ�I�ȕ��͋C�̒��ŁA1�l�ЂƂ�̌��₩�Ȑ�����ی�҂Ƌ��Ɍ����܂��B�E�@�H�ׂ�A�Q��A�V�ԁA�Ȃǂ̋K�������������̃��Y���𐮂��A��v�Ȃ��炾���̂���`�������܂��B�E�G�߂̍s���⊈����ʂ��A�D��S��ӗ~��{���A���含����݂܂��B�E�@�ٔN��ł̂�������ʂ��݂����炿�������ƂŁA�v�����̋C��������Ă܂��B�E�E���͂����������܂Ȃ����������ĕۈ�ɂ�����Ƌ��ɁA��Ɏ��Ȍ��r�ɓw�߂܂��B,�����̗��p�Ґ��́A���l�sHP�ɂČ��\���Ă��܂��B�ۈ珊�ۈ�w�j�Ɋ�Â����ۈ��񋟂��܂��B�q�ǂ����������S���ĉ߂�������𐮂��A���������Đ������A�ۈ�m��F�B�Ƃ������Ȃ���A���낢��ȑ̌���ʂ��Đ�����͂̊�b�ƂȂ镔������Ă܂��B,���H�̂ݎ��{,"���j��,�Ηj��,���j��,�ؗj��,���j��,�y�j��",����,�Ȃ�,�Ȃ�,,,,����t�S���ҁF�����������ӔC�ҁF��������O�҈ψ��F���������ψ��A�a���ۈ�m,�i���j�R�[�v���C�t�T�[�r�X�@�����ӔC�ی�1���ɂ��ō��T���~�@�@�P���̂ɂ��ō�10���~,�ƒ�I�ŏ��K�͂Ȋ��̒��ŁA�N��ɂ��N���X�����͂����A�n��Ƃ������Ȃ��疾�邭�ۈ�����Ă��܂��B����͂���܂��񂪁A�V�C���ǂ���΋߂��̌����ŗV�񂾂�A���]�쉈�����U��������A�w�̂��΂܂ŕ����ēd�Ԃ�������ȂǁA�ߑO���͊O�֏o��悤�ɂ��Ă��܂��B,����,���ʎ��A�����@�@430�~�i�K�v�ɉ����j���悯�t�����X�q�@�@887�~�X�i�b�v�ʐ^��@�@1��30�~���x�i�e���̒����ɂ��j�����萔���@�@1��200�~(��]�҂̂݁j,6000,�Ȃ�,,,����,����,����,"���k�A����t�����̐ݒu,���k�A�����e�̋L�^,���k�A���Ɋւ���s�������{���Ƃւ̋���,���P���ʂ̎s�����ւ̕�","���̔������̑Ή��y�ю��̔����h�~�̂��߂̎w�j�̐���,���̔������̕񍐋y�щ��P������m�O�ꂷ��̐��̐���,���̔����h�~�̂��߂̒���I�Ȍ��C�̎��{","�閧�ێ��ɌW��K���̐���,�閧�ێ��ɌW�錤�C�̎��{",�����{,
NPO �@�l,�ׂ�������,�����c�������@�l�x�C�L�b�Y,2400051,�_�ސ쌧,���l�s�ۓy�P�J��,�㐛�c���P�T�X�O�|�P,�U�E�s�[�X�v���C�X���l�Q�O�W��,045-264-8266,,1410004001004 ,,����,���K�͕ۈ玖�Ǝҁ|A�^,�ׂ��������@��������ق�������,�x�C�L�b�Y�@��������ۈ牀,1410052002847 ,2240007,�_�ސ쌧,���l�s�s�}��,�`�c��P�|�P�Q�|�Q�W,,045-530-0777,,2015/4/1,2014/4/1,2015/4/1,���l�s�݂ǂ�ۈ牀,������̎󂯎M�Ƃ��Ă̎x��,,,,,,,,,,,,,,,,,,,,,,,,,,,3,3,8,5,,,,,,,,,,,,,,,,,3,3,1,�ۈ�m���i,,2014/4/1,7:30,19:00,7:30,18:30,,,,,,,,,2,,,4,,,4,,,0,,,0,,,0,,,10,,,https://www.bay-kids.com/index.html,�����̗��p�Ґ��́A���l�sHP�ɂČ��\���Ă��܂��B,���H�̂ݎ��{,"���j��,�Ηj��,���j��,�ؗj��,���j��,�y�j��",����,,,,,,���������ӔC�ҁ@�@�@�@�{�ݒ��������������@ �@�@�@�@�ۈ�m����������O�҈ψ��@�@NPO�@�l�����������肷�������ENPO�@�l�O�o�T�|�[�g�Z���^�[�������@,�����C������΍Еی�������Ёi�{�ݔ����ӔC�ی��A�������Q�ی��j1���̂ɂ�10���~,�����̓��F���@�΂Ɉ͂܂ꂽ���F�̈ꌬ�Ƃ��u��������ۈ牀�v�ł��B�L�����낪����A��؂͔̍|�A�v�[���V�сA���V�сA�S���������A1�N��ʂ��Ă������ƊO�V�т����܂��B�܂��A�������U���֏o�|���l�G�������Ȃ��玩�R�ƐG�ꍇ���Ă��܂��B���X�̐H���́A�H�ו��ɋ����������A�y�����H�����ł���悤�H��ɂ��͂����Ă��܂��B���l���ł��ߍׂ₩�ȕۈ��O���ɁA��l�ЂƂ�̌����؂ɂ��A�ی�҂̕��Ƌ��Ɏq�ǂ��̐�����������Ă����܂��B�������ɂ���l�ȁA�������Ƃ������邭�ƒ�I�ȕ��͋C���؂ɂ��Ă��܂��B,����,�L�����܂ߒ��ډ��ɂ��₢���킹���������B,,�Ȃ�,,,����,����,����,"���k�A����t�����̐ݒu,���k�A�����e�̋L�^,���k�A���Ɋւ���s�������{���Ƃւ̋���,���P���ʂ̎s�����ւ̕�","���̔������̑Ή��y�ю��̔����h�~�̂��߂̎w�j�̐���,���̔������̕񍐋y�щ��P������m�O�ꂷ��̐��̐���,���̔����h�~�̂��߂̒���I�Ȍ��C�̎��{","�閧�ێ��ɌW��K���̐���,�閧�ێ��ɌW�錤�C�̎��{",�����{,
�c���@�l�i������Г��j,����[���[���@���Ԃ�����������,�X���[�V�[�Y�������,1050012,�����s,�`��,�ő��P�|�P�U�|�S,,03-6435-7134,,1310308000126 ,,����,���K�͕ۈ玖�Ǝҁ|A�^,�����[�ق������񂳂��炬���傤,�L�����[�ۈ牀���ؒ�,1410052004256 ,2200042,�_�ސ쌧,���l�s����,�˕����Q�|�Q�R�|�P,�A�u�\���[�g�Q�K,045-315-7150,,2016/3/31,2016/4/1,2016/3/31,,,,,,,,,,,,,,,,,,,,,,,,,,,,,,,,,,,,,,,,,,,,,,,,,,,,,,2016/4/1,7:30,19:30,7:30,18:30,,,,,,,,,3,,,8,,,8,,,0,,,0,,,0,,,19,,,�ۈ�҂Ǝq�ǂ��̐M���֌W����Ղɂ��āA�n���ƒ�ƘA�g���Ȃ���A�q�ǂ����S�g�Ƃ��Ɍ��N�ŏ�����肷����𐮂��A�������ƌ��ɂ��ӂ�鎩���炵���Ɛ��ݔ\�͂𔭊��ł���悤�ɂ��Ă��B�q�ǂ��̐����E���B�ɕK�v�Ȃ����сB�l�X�Ȑl��o�����Ɍ��������o���y�ђ��킷��ӗ~���؂ɂ��邱�Ƃɂ�萶����͂����ł����B�E�����ۈ�@����,�����̗��p�Ґ��́A���l�sHP�ɂČ��\���Ă��܂��B,���H�̂ݎ��{,"���j��,�Ηj��,���j��,�ؗj��,���j��,�y�j��",����,,,,,,,,,����,�L�����܂ߒ��ډ��ɂ��₢���킹���������B,,�Ȃ�,,,����,����,����,,,,,
�c���@�l�i������Г��j,���Ԃ�����������Ă��[����,������Ѓe�B�[�G�X,1080071,�����s,�`��,������T�|�S�|�R,,03-5860-2106,,1410008001539 ,,�Ȃ�,���K�͕ۈ玖�Ǝҁ|A�^,�����Ă��܂���ق�������,�K��X�}�C���ۈ牀,1410052004876 ,2300001,�_�ސ쌧,���l�s�ߌ���,����S�|�V�|�Q�P,���C�I���Y�r���K��P�O�P,045-718-5314,,2018/3/30,2018/4/1,2018/4/1,��߂���ۈ牀,"�s���ւ̎Q���Ɋւ���x��,������̎󂯎M�Ƃ��Ă̎x��",����ۈ牀,"�s���ւ̎Q���Ɋւ���x��,������̎󂯎M�Ƃ��Ă̎x��",��������ڂ̕ۈ牀,"�s���ւ̎Q���Ɋւ���x��,������̎󂯎M�Ƃ��Ă̎x��",����������͂����@���E�\���C��,"���O�V�Z��̗��p�Ɋւ���x��,�s���ւ̎Q���Ɋւ���x��,������̎󂯎M�Ƃ��Ă̎x��",���l����_��ۈ牀,������̎󂯎M�Ƃ��Ă̎x��,,,,,,,,,,,,,,,,,,,7,2,8,8.4,11.1,,,,,,,,,,,,,,,,7,2,,"�ۈ�m���i,�c�t�����@�Ƌ�",,2018/4/1,7:00,19:00,7:30,18:30,,,,,,,,,3,,,8,,,8,,,0,,,0,,,0,,,19,,,���ۈ痝�O���@�u�Ί炠�ӂ��ۈ牀�v���ۈ���j���E�q�ǂ��������A�Ί�ŉ߂�������Â����ڎw���܂��E�ƒ�I�ȕ��͋C��厖�ɁA����s���͂��������ۈ��ڎw���܂����ۈ�ڕW���E���S�E�q���I�Ȋ��ɂ����āA��{�I�Ȑ����K����{���E�l�X�Ȋy�����̌�����A�����ւ̈ӗ~��{���E���ЂƂ̊ւ��̒��ŁA����E�M�����E�v�����̐S��{����0.1.2�΂̓����ɓ����������K�͂Ȃ�ł͂̕ۈ�����A�b�g�z�[���ł������Ƃ������͋C�̕ۈ灖�q�ǂ���l��l�ɔ��B�ߒ��ɉ������ۈ�,�����̗��p�Ґ��́A���l�sHP�ɂČ��\���Ă��܂��B�ۈ珊�ۈ�w�j�Ɋ�Â��񋟂��܂��B��0�Ύ��@�E�q���I�ň��S�Ȋ��̂��Ɛ������Y����g�ɂ��Ȃ��猒�N�I�ɉ߂����E�ۈ�҂Ǝ�e�I�A�����I�Ȋւ��̒��ŁA�M���֌W��z���E�g�߂Ȃ��̂ɋ����������Ċւ��A�D��S�̉萶������ށ@��1�Ύ��E�����ɕK�v�ȋZ�\���݂ɂ��A�������Ă݂悤�Ƃ��āA�ւ�낤�Ƃ���E�ۈ�҂⑼���Ƃ������Ȃ��琶����V�т̒��ŏ��������t�ŕ\�����邱�Ƃ��o����悤�ɂȂ�E�T�������A�͕�A�Č��V�сA�l�X�Ȋ��G�ɐG��邱�ƂȂǂ�ʂ��āA���͂ւ̋�����֐S�����߁A�����Ƌ��L���ċ�����֐S�����[�߂Ă������Ƃ��遖2�Ύ��E�q�ǂ����m�̊ւ��̒��ŁA���ɂ͎v���悤�ɂ����Ȃ��Ƃ��ɂ͎v���悤�ɂ����Ȃ��C�����ƌ��������Ȃ���S�n�悢�֌W�ɒz���E�F�B�ƈꏏ�ɗV�сA�l�X�Ȍo�������钆�ŁA�����⋤�������炿�A�����̂��������Ƃ����t��s���Ŏ�̓I�ɕ\������B�E�l�X�ȉ^���V�т��s�����ŁA�^���@�\��w��̋@�\�����B����,���H�̂ݎ��{,"���j��,�Ηj��,���j��,�ؗj��,���j��,�y�j��",����,�Ȃ�,�Ȃ�,,,,���ӔC�ҁF�ΐ�@���b�q����t�S���F�k���@���S�q����3�҈ψ���F�����ψ��@�Έ�@�x�m�v�@�@�@�@�@�@�@�@�@�@�@�@�@������@�ɓ��@�[��,"���{�X�|�[�c�U���Z���^�[�ЊQ���ϋ��t���x�i���S�E���Q�������E�H���Łj�ō��@4,000���~�O��Z�F�C��ی��i�����ӔC�ی��j5,000���~",4���F�������E�i���@5���F�l�ʒk�i�݉����j�E���Ȍ��f�@6���F�ۈ�Q�ρE���Ȍ��f�@7���F���[�E���V�сE�v�[���V�сE�čՂ育����8���F���V�сE�v�[�������с@9���F���V�є[�߁E�ɂ��ɂ��E�B�[�N?����Ă݂悤?�@10���F���Ȍ��f�E�n���E�B���@11���F���Ȍ��f12���F�N���X�}�X��y���݉�@1���F�������V�с@2���F�ߕ��@3���F�ЂȍՂ�E���ʂ��E�������q�ۈ���e�̓��F�r�E�ۈ痘�p���i���j~�i�y�j���H�񋟁E�����A�a������E���P���E�g�̑�����s���Ă��܂��B�E���V�сE�v�[���V�т͉���X�y�[�X�Ŏ��{�B�E���_���؁i���܂����A�~�j�g�}�g�A�卪�@���j���͔|���ȒP�ȃN�b�L���O�ۈ�����{�B,����,�i�P�j�w�����镨�E ���X�q���P�P�O�O�@�E�A�������S�T�O�i0�Ύ��̂݁@�y�[�W�I����čw���j�E�A�����t�@�C�����S�O�O�i�P�C�Q�Ύ��j�E�X�|�[�c�U���Z���^�[���ρ��R�U�T�i�N�P��j �����X�q��A�����t�@�C����1�x�w������Ζ��N�x�w��������̂ł͂���܂���B�ʐ^����iL�ŁF��80�@�@�ʐ^�f�[�^�F��120�j��]�҂̂݁��ʐ^�͊O���ϑ����Ă���R�h�������璼�ڍw���ƂȂ�܂��B�i�Q�j�����ۈ痿�i�ۈ痘�p�j�i���p�҂̂݁j�����ۈ痘�p���@1�O���ȓ����W�T�O/30���@�@1�P���ȏく�P�V�O�O/30���������ۈ�𗘗p����ꍇ�́A�E���z�u���̏��������邽�߁A���O�ɉ��ւ̐\�����݂��K�v�ł�,1915,�Ȃ�,,,����,����,����,"���k�A����t�����̐ݒu,���k�A�����e�̋L�^,���k�A���Ɋւ���s�������{���Ƃւ̋���,���P���ʂ̎s�����ւ̕�","���̔������̑Ή��y�ю��̔����h�~�̂��߂̎w�j�̐���,���̔������̕񍐋y�щ��P������m�O�ꂷ��̐��̐���,���̔����h�~�̂��߂̒���I�Ȍ��C�̎��{","�閧�ێ��ɌW��K���̐���,�閧�ێ��ɌW�錤�C�̎��{,���̑�",�����{,
�c���@�l�i������Г��j,���Ԃ�����������@�Ƃ��낵��,������Ё@�\�F��,2260011,�_�ސ쌧,���l�s�t��,�������u�T���ڂQ�|�S,,045-507-3804,,1410008001208 ,,����,���K�͕ۈ玖�Ǝҁ|A�^,�Ƃ��낫�������܂Ղ�[���ق�������,�Ƃ��낫�������܃v���[�U�ۈ牀,1410052004975 ,2250002,�_�ސ쌧,���l�s�t��,�������u�T�|�Q�|�S,,045-509-1921,,2018/3/30,2018/4/1,2018/4/1,�A�[�g�`���C���h�P�A���ۂ��Ղ��܃v���[�U,"���O�V�Z��̗��p�Ɋւ���x��,�����ۈ�Ɋւ���x��,�s���ւ̎Q���Ɋւ���x��,������̎󂯎M�Ƃ��Ă̎x��",�O���[�o���L�b�Y�������u�ۈ牀,"���O�V�Z��̗��p�Ɋւ���x��,�����ۈ�Ɋւ���x��,�s���ւ̎Q���Ɋւ���x��,������̎󂯎M�Ƃ��Ă̎x��",���܃v���[�U����������,"���O�V�Z��̗��p�Ɋւ���x��,�����ۈ�Ɋւ���x��,�s���ւ̎Q���Ɋւ���x��,������̎󂯎M�Ƃ��Ă̎x��",���܃v���[�U�̂��ݕۈ牀,"���O�V�Z��̗��p�Ɋւ���x��,�����ۈ�Ɋւ���x��,�s���ւ̎Q���Ɋւ���x��,������̎󂯎M�Ƃ��Ă̎x��",,,,,,,,,,,,,,,,,,,,,4,5,8,11,,,,,,,,,,,,,,,,,4,5,,"�ۈ�m���i,�c�t�����@�Ƌ�",,2018/4/1,7:30,19:30,7:30,18:30,,,,,,,,,4,,,4,,,4,,,0,,,0,,,0,,,12,,,�y�z�[���y�[�W�zhttps://www.toirokids.com/�y�ۈ痝�O�z�u�\�l�\��i���イ�ɂ�Ƃ����j�v�q�ǂ��̋C��������𑸂сu���̎q�炵���v�������o��0�`2�Ύ����̏��K�͔F�ۈ牀����l�ЂƂ肪�S���E�̒��S�B�q�ǂ������������A�����炵���K���ɐ����Ă����͂̊�b�i��F�m�\�͂̍������j����߂�悤�A�����A1�`3�Ζ������̔��B�ɂ����ē��ɑ�؂ȁu�����`���v�u���ȍm�芴�v�u�͕�́v�u����̉萶���v�u�\���v�u�g�́E���N�v�u�H�̂͂��܂�v�ɁA��ЂƂ��J�Ɋ��Y���ۈ���؂ɂ��Ă��܂��B,�����̗��p�Ґ��́A���l�sHP�ɂČ��\���Ă��܂��B�ڂ����͓����̃z�[���y�[�W���������������Bhttps://www.toirokids.com/,���H�̂ݎ��{,"���j��,�Ηj��,���j��,�ؗj��,���j��,�y�j��",����,,,,,,�������ӔC�ҁF�����Љ���@��82���̋K��ɂ��A�������p�ғ�����̋��̓K�؂ȉ����ɓw�߂邽�߁A �������ӔC�ҁA����t�S���҂���ё�O�҈ψ������L�̒ʂ�ݒu���Ă���܂��B�ڂ����͓����̃z�[���y�[�W���������������Bhttps://www.toirokids.com/solution.php,�����ł́A�ȉ��̕ی��ɉ������Ă��܂��B�@���{�X�|�[�c�U���Z���^�[�ЊQ���ϋ��t�|���͉��ƕی�҂ł̕��S�ɂȂ�܂��B�i�ی�ҕ��S�z�F�N�z 210�~�j�A���K�͕ۋ摍���⏞���x�iNPO�@�l�S�����K�͕ۈ狦�c��E�W�F�C�A�C���Q�΍Еی�������Ёj�ی����͑S�z���������S���܂��B,�u�����̊G�{�E�����̉́v�N���X���Ɂu�����̊G�{�v��ݒ肵�A�z���͂�\���͂���݂܂��B�܂��A�G�߂̂��̂�A�ی�҂̕��������ɂ��q����ƈꏏ�Ɋy���߂���׉̂ȂǁA�����e�[�}���̂���u�����̉́v��ݒ肵���X�y���ނ��Ƃŕ\������y��������݂܂��B�u�ˊO�����Ǝ��������сv�q�ǂ�����������I�Ɂu�݂�v�u�����v�u�����v�u�����v��ʂ��ėl�X�ȑ̌���������悤�ˊO�����⎺���V�т̓��e���\�����܂��B���ꂽ���͖����ˊO�ւ��U���ɏo�����܂��B�����ł́A�˂�ǂ�u���b�N�A��p���A����̐H�ނȂǌ����Ă����т�q�ǂ��̖͕�͂��؂ɂ����V�т��߂鎞�Ԃ��؂ɂ��܂��B�u���Y�������сi�����P��j�v����1��A�q�ǂ������������Ƃ����R�ɐg�̂ŕ\�����Ă����ԃv���O�����ł��B�q�ǂ����g�̎��含��ӗ~�������o���A�������u�y�����v�������邱�ƂŁA������\���͂���݂܂��B�u�^�������сi�����P��j�v�R�[����{�[���Ȃǂ̓����p���Ȃ���y�����g�̂𓮂����^�������т��s���܂��B�����ȖڕW����ЂƂł���悤�ɂȂ��Ă������ƂŐ����̌���{���A0�`2�Ύ����̈炿�ɑ�؂Ȏ��ȍm�芴���F�m�\�͂̍���������݂܂��B,����,�L�����܂ߒ��ډ��ɂ��₢���킹���������B,,�Ȃ�,,,����,����,����,"���k�A����t�����̐ݒu,���k�A�����e�̋L�^,���k�A���Ɋւ���s�������{���Ƃւ̋���,���P���ʂ̎s�����ւ̕�","���̔������̑Ή��y�ю��̔����h�~�̂��߂̎w�j�̐���,���̔������̕񍐋y�щ��P������m�O�ꂷ��̐��̐���,���̔����h�~�̂��߂̒���I�Ȍ��C�̎��{","�閧�ێ��ɌW��K���̐���,�閧�ێ��ɌW�錤�C�̎��{",�����{,
�c���@�l�i������Г��j,���Ђ���,�L����Ђ��Ђ���,2350016,�_�ސ쌧,���l�s��q��,��q�R�|�P�P�|�Q�O,,045-752-0130,,1410008000937 ,,�Ȃ�,���K�͕ۈ玖�Ǝҁ|A�^,���肨�Ђ��܂ق�������,�X���Ђ��ܕۈ牀,1410052002854 ,2350023,�_�ސ쌧,���l�s��q��,�X�Q�|�T�|�P�S,�f�B�A�R�[�g�E�h�G���P�O�P,045-758-0130,,2015/4/1,2014/9/1,2015/4/1,,,,,,,,,,,,,,,,,,,,,,,,,,,,,,,,,,,,,,,,,,,,,,,,,,,,,,2014/9/1,7:30,18:30,7:30,18:30,,,,,,,,,3,,,3,,,3,,,0,,,0,,,0,,,9,,,�y��{���O�z�W�c�̒��Ŏq�ǂ���l�ЂƂ肪�����炵�������������o�����B�y�ۈ���j�z�ƒ�I�ȕ��͋C�̒��ŁA�q�ǂ��炵���̂т̂тƂ����������p�ӂ��A���̒��ł̈�l�ЂƂ�̌��������L�΂���ۈ��ڎw���B�q�ǂ��A�ی�҂ƕۈ牀���M����������悤�Ȋ֌W��z���Ă����B,�����̗��p�Ґ��́A���l�sHP�ɂČ��\���Ă��܂��B,���H�̂ݎ��{,"���j��,�Ηj��,���j��,�ؗj��,���j��,�y�j��",����,,,,,,,,,����,�L�����܂ߒ��ډ��ɂ��₢���킹���������B,,�Ȃ�,,,����,����,����,,,,,
NPO �@�l,��������,�����c�������@�l��������,2460022,�_�ސ쌧,���l�s���J��,�O�c���P�O�|�U�R�X���r���S�e,,045-367-7224,,1410004001079 ,,����,���K�͕ۈ玖�Ǝҁ|A�^,�˂��Ƃۂ�,�l�X�g�ۂ�,1410052002862 ,2460031,�_�ސ쌧,���l�s���J��,���J�R�|�P�O�|�T,,045-302-8002,,2015/4/1,2011/4/1,2015/4/1,,,,,,,,,,,,,,,,,,,,,,,,,,,,,5,6,,,,,,,,,,,,,,,,,,,5,6,,"�ۈ�m���i,�c�t�����@�Ƌ�",,2011/4/1,7:30,20:00,7:30,18:30,,,,,,,,,5,4,1,7,9,1,7,6,1,0,,,0,,,0,,,19,19,3,�E�q�ǂ����������S���Ď��Ȃ𔭊����Ċ����ł���悤���肵���֌W��z���܂��B�E�q�ǂ��̈�͂�M���A���̈炿���������Ă����܂��B�E�@�l�̎q��Ďx�����ƂƘA�g�����Ȃ���A�n��̃j�[�Y�ɍ������ۈ��񋟂��܂��B�E����������ɕی�҂Ƃ̐M���֌W��z���A�q��Ă̔����҂ƂȂ�܂��B�E�ꎞ�ۈ�ȂǂŒn��̐e�q��ϋɓI�Ɏ󂯓���܂��B,�����̗��p�Ґ��́A���l�sHP�ɂČ��\���Ă��܂��B,���H�̂ݎ��{,"���j��,�Ηj��,���j��,�ؗj��,���j��,�y�j��",����,����,�Ȃ�,,,�y�ꎞ�ۈ玖�Ǝ��{�z���p����ɋ󂫂�����ꍇ�A�󂯓���\,���k�E����t�S���ҁF�ۈ�ӔC�ґ��k�E�������ӔC�ҁF�Ǘ��ґ�O�҈ψ��F�@�l����,���K�͕ۈ瑍���ۏᐧ�x�i�{�ݔ����ӔC�ی��A���Q�ہj�ō�10000���~���{�X�|�[�c�U���Z���^�[�@�ЊQ���ϋ��t�i���S�������A���Q�������A�����A�H���œ��j�ō�3770���~,,����,���ނ�2000�~/���i���ނ�����܂ށj�A�z�c���[�X��200�~/���A�X�q��1000�~�O��i�������j�A�V�[�c��946�~�i���ōw���̏ꍇ�j�A���ϊ|��210�~/�N�A������p�i���z�͍s����ɂ���ĈقȂ�܂��j���ʐ^�̔��͊O���ϑ����Ă��܂��̂�v���ڍw���ƂȂ�܂��B,,�Ȃ�,,,����,����,����,"���k�A����t�����̐ݒu,���k�A�����e�̋L�^",,�閧�ێ��ɌW�錤�C�̎��{,�����{,